{"text_format":"1","workbook":"xlsx","n_sheets":8,"sheets":["Kalender","Aanwezig","Goals","Assists","Statistieken","Wedstrijdblad","Mal-T","Put-U"],"not_rendered":{"charts":0,"images":1,"macros":1,"external_links":0,"defined_names":1,"comments":0,"pivot_tables":0},"unopened":[],"bounds":{"document_bytes":16777216,"sheet_cells":100000,"rows_first":2000,"rows_last":500,"rows_between":2000,"halvings":0,"cell_chars":16384,"cell_head_chars":4096},"cells_cut":0,"cells_raw":0,"read":"whole","date_system":"1900"}

{"sheet":"Kalender","index":0,"n_rows":51,"n_cols":14,"rows_kept":51,"cut":false,"hidden":false,"merged":[[22,7,22,8],[23,7,23,8],[20,7,20,8],[25,7,25,8],[55,1,55,2],[55,4,55,6],[0,0,0,13],[1,10,1,13],[2,7,2,8],[3,10,3,13],[4,10,4,13],[18,10,18,13],[20,10,20,13],[6,10,6,13],[7,10,7,13],[1,0,1,8],[9,7,9,9],[17,7,17,9],[23,10,24,13],[50,4,50,6],[50,1,50,2],[48,1,48,2],[49,1,49,2],[47,4,47,6],[48,4,48,6],[49,4,49,6],[46,1,46,2],[42,0,43,8],[44,1,44,2],[45,1,45,2],[47,1,47,2],[46,4,46,6],[44,4,44,6],[45,4,45,6]]}
["K.B.L.V.B. competitie seizoen 2017 - 2018"]
["Wedstrijd kalender",null,null,null,null,null,null,null,null,null,"Extra info"]
["Datum","Info","Uur ","Uur ","Thuisploeg",null,"Bezoekers","Uitslag",null,null,"VERWITTIGEN : "]
[null,null,"samenkomst","spelen",null,null,null,null,null,null,"Als je niet kan komen doe je door persoonlijk naar Bart Vercammen (0486/95.11.17) "]
["2017-09-03","Speeldag 1","9u15","10u00","KWB Hombeek","~","VFL Malines",5,0,null," te bellen of SMS-en en dit ten laatste vrijdag voor de wedstrijd."]
["2017-09-10","Speeldag 2","8u45","10u00","KWB Putte","~","KWB Hombeek",2,5]
["2017-09-17","Speeldag 3","9u15","10u00","KWB Hombeek","~","Boerenb. Broechem",null,null,null,"We komen steeds samen aan het KWB-chalet.  Indien er op een andere plaats wordt samengekomen,"]
["2017-09-24","Speeldag 4",null,null,"Vrij","~","KWB Hombeek",null,null,null,"wordt dit ten laatste op donderdag verwittigd via e-mail."]
["2017-10-01","Beker voorronde","9u15","10u00","KWB Hombeek","~","FC Vilv Heverlee"]
["2017-10-08","Speeldag 5","8u15","9u30","VK Wakkerzeel","~","KWB Hombeek","Uitgesteld"]
["2017-10-15","Speeldag 6","9u15","10u00","KWB Hombeek","~","VK Albatros",null,null,null,"Coach : Bart Vercammen (in samenspraak met Angelo)"]
["2017-10-22","Speeldag 7","9u00","10u00","Vosberg Sport","~","KWB Hombeek",null,null,null,"Kapitein : Sander Beeckmans - Kristof Wouters - Mark Roosen"]
["2017-10-29","Beker voorronde","8u15","9u30","FC Vilv Heverlee","~","KWB Hombeek",null,null,null,"Trainer : Angelo Gysen"]
["2017-11-05","Speeldag 8","9u15","10u00","KWB Hombeek","~","Jamaswapi"]
["2017-11-12","Speeldag 9","8u30","9u30","FC Blaasveld","~","KWB Hombeek",null,null,null,"Trainingen : elke donderdag om 20u00 (samenkomen vanf 19u30) - begin augustus tot eind mei"]
["2017-11-19","Speeldag 10","9u15","10u00","KWB Hombeek","~","Plenke Werchter",null,null,null,"Website : www.kwbvoetbalhombeek.be"]
["2017-11-26","Beker 1/8 finale","9u15","10u00","KWB Hombeek","~","VVS Rotselaar"]
["2017-12-03","Speeldag 11","8u45","9u30","Ludwina Bonheiden","~","KWB Hombeek","Uitgesteld",null,null,"Afgelaste wedstrijden : "]
["2017-12-10","Inhaalwedstrijden","8u15","9u30","VK Wakkerzeel","~","KWB Hombeek",null,null,null,"Site KBLVB of facebook pagina KBLVB"]
["2017-12-17","Beker kwartfinale",null,null,null,"~"]
["2017-12-24"," Geen wedstrijden",null,null,null,null,null,null,null,null,"K.B.L.V.B. : www.kblvb.be - 016/20 14 13 (uitslagen doorbellen voor 12u30)"]
["2017-12-31"," Geen wedstrijden"]
["2018-01-07","Speeldag 12","10u15","11u00","VFL Malines","~","KWB Hombeek"]
["2018-01-14","Speeldag 13","9u15","10u00","KWB Hombeek","~","KWB Putte",null,null,null,"Gegevens ploegen"]
["2018-01-21","Speeldag 14","8u15","9u30","Boerenb. Broechem","~","KWB Hombeek"]
["2018-01-28","Inhaalwedstrijden","8u45","9u30","Ludwina Bonheiden","~","KWB Hombeek"]
["2018-02-04","Speeldag 15"," "," ","KWB Hombeek","~","Vrij",null,null,null,"Naam en adres","Shirt",null,"Broek"]
["2018-02-11","Speeldag 16","8u45","10u00","KWB Hombeek","~","VK Wakkerzeel",null,null,null,"Boerenbond Broechem"]
["2018-02-18","Speeldag 17","10u15","11u00","VK Albatros","~","KWB Hombeek",null,null,null,"KFC Broechem, Abelebaan, 2520  Broechem"]
["2018-02-25","Beker halve finale"," "," ",null,null," ",null,null,null,"FC Blaasveld"]
["2018-03-04","Speeldag 18","9u15","10u00","KWB Hombeek","~","Vosberg Sport",null,null,null,"Broekstraat  159, 2830  Blaasveld"]
["2018-03-11","Speeldag 19","9u15","10u00","Jamaswapi","~","KWB Hombeek",null,null,null,"VK Jamaswapi Mechelen"]
["2018-03-18","Speeldag 20","9u15","10u00","KWB Hombeek","~","FC Blaasveld",null,null,null,"Sporthal Kouter, Dorpsstraat 67, 2811  Leest"]
["2018-03-25","Speeldag 21","8u15","9u30","Plenke Werchter","~","KWB Hombeek",null,null,null,"KWB Putte"]
["2018-04-01","Geen wedstrijden",null,null,null," "," ",null,null,null,"Tinstraat, Putte"]
["2018-04-08","Speeldag 22","9u15","10u00","KWB Hombeek","~","Ludwina Bonheiden",null,null,null,"Ludwina Bonheiden"]
["2018-04-15","Inhaalwedstrijden",null,null,null,null,null,null,null,null,"Sporthal \"Berentrode\", Grote Doelstraat 1 b, 2820  Bonheiden"]
["2018-04-22","Inhaalwedstrijden",null,null,null,null,null,null,null,null,"Plenke Werchter"]
["2018-04-29","Beker finale",null,null,null,null,null,null,null,null,"Tremelobaan 21, Werchter"]
[null,null,null,null,null,null,null,null,null,null,"VFL Malines"]
[null,null,null,null,null,null,null,null,null,null,"Holmlei 64, 2800  Mechelen"]
[null,null,null,null,null,null,null,null,null,null,"VK Albatros"]
["Kalender andere activiteiten",null,null,null,null,null,null,null,null,null,"Holmlei 64, 2800  Mechelen"]
[null,null,null,null,null,null,null,null,null,null,"VK Wakkerzeel"]
["2017-11-10","Sportquiz KWB",null,"20u00","KWB-chalet",null,null,null,null,null,"Kelfsstraat, 3150  Wakkerzeel"]
["02/03dec17","Teambuilding",null," "," ",null,null,null,null,null,"Vosberg Sport Rumst"]
["2018-01-14","Nieuwjaarsreceptie",null,"13u00","KWB-chalet",null,null,null,null,null,"Sporthal \"uitgedekte schoor\", Europalaan 3, 2840  Rumst (Terhagen)"]
["2018-02-03","Spaghettidag",null,"9u00","zaal \"Vrolijke vrienden"]
["2018-04-27","Eindeseizoensetentje",null,"20u00","KWB-chalet"]
["18/22mei18","Weekend",null,null,"De Panne"]
["2018-05-31","Algemene vergadering",null,"21u00","KWB-chalet"]

{"sheet":"Aanwezig","index":1,"n_rows":50,"n_cols":41,"rows_kept":50,"cut":false,"hidden":false,"merged":[[49,4,49,10],[2,37,6,37],[2,39,6,39],[0,0,0,40],[2,40,6,40],[2,33,6,33],[2,34,6,34],[2,35,6,35],[2,36,6,36],[2,29,6,29],[2,30,6,30],[2,32,6,32],[2,31,6,31],[2,38,6,38],[46,20,46,26],[47,20,47,26],[48,20,48,26],[46,28,46,34],[47,28,47,34],[48,28,48,34],[47,4,47,10],[46,4,46,10],[48,4,48,10],[48,12,48,18],[47,12,47,18],[46,12,46,18]]}
["Aanwezigheden spelers seizoen 2017-2018"]
[null,{"$f":"Kalender!$G$5","v":"VFL Malines"},{"$f":"Kalender!$G$6","v":"KWB Hombeek"},{"$f":"Kalender!$G$7","v":"Boerenb. Broechem"},{"$f":"Kalender!$G$9","v":"FC Vilv Heverlee"},{"$f":"Kalender!$G$10","v":"KWB Hombeek"},{"$f":"Kalender!$G$11","v":"VK Albatros"},{"$f":"Kalender!$G$12","v":"KWB Hombeek"},{"$f":"Kalender!$G$13","v":"KWB Hombeek"},{"$f":"Kalender!$G$14","v":"Jamaswapi"},{"$f":"Kalender!$G$15","v":"KWB Hombeek"},{"$f":"Kalender!$G$16","v":"Plenke Werchter"},{"$f":"Kalender!$G$17","v":"VVS Rotselaar"},{"$f":"Kalender!$G$18","v":"KWB Hombeek"},{"$f":"Kalender!$G$23","v":"KWB Hombeek"},{"$f":"Kalender!$G$24","v":"KWB Putte"},{"$f":"Kalender!$G$25","v":"KWB Hombeek"},{"$f":"Kalender!$G$28","v":"VK Wakkerzeel"},{"$f":"Kalender!$G$29","v":"KWB Hombeek"},{"$f":"Kalender!$G$31","v":"Vosberg Sport"},{"$f":"Kalender!$G$32","v":"KWB Hombeek"},{"$f":"Kalender!$G$33","v":"FC Blaasveld"},{"$f":"Kalender!$G$34","v":"KWB Hombeek"},{"$f":"Kalender!$G$36","v":"Ludwina Bonheiden"}]
[null,{"$f":"IF(Kalender!$I$5=\"\",\"\",Kalender!$I$5)","v":0},{"$f":"IF(Kalender!$I$6=\"\",\"\",Kalender!$I$6)","v":5},{"$f":"IF(Kalender!$I$7=\"\",\"\",Kalender!$I$7)","v":""},{"$f":"IF(Kalender!$I$9=\"\",\"\",Kalender!$I$9)","v":""},{"$f":"IF(Kalender!$I$10=\"\",\"\",Kalender!$I$10)","v":""},{"$f":"IF(Kalender!$I$11=\"\",\"\",Kalender!$I$11)","v":""},{"$f":"IF(Kalender!$I$12=\"\",\"\",Kalender!$I12)","v":""},{"$f":"IF(Kalender!$I$13=\"\",\"\",Kalender!$I$13)","v":""},{"$f":"IF(Kalender!$I$14=\"\",\"\",Kalender!$I$14)","v":""},{"$f":"IF(Kalender!$I$15=\"\",\"\",Kalender!$I$15)","v":""},{"$f":"IF(Kalender!$I$16=\"\",\"\",Kalender!$I$16)","v":""},{"$f":"IF(Kalender!$I$17=\"\",\"\",Kalender!$I$17)","v":""},{"$f":"IF(Kalender!$I$18=\"\",\"\",Kalender!$I$18)","v":""},{"$f":"IF(Kalender!$I$36=\"\",\"\",Kalender!$I$36)","v":""},{"$f":"IF(Kalender!$I$38=\"\",\"\",Kalender!$I$38)","v":""},{"$f":"IF(Kalender!$I$25=\"\",\"\",Kalender!$I$25)","v":""},{"$f":"IF(Kalender!$I$28=\"\",\"\",Kalender!$I$28)","v":""},{"$f":"IF(Kalender!$I$29=\"\",\"\",Kalender!$I$29)","v":""},{"$f":"IF(Kalender!$I$31=\"\",\"\",Kalender!$I$31)","v":""},{"$f":"IF(Kalender!$I$32=\"\",\"\",Kalender!$I$32)","v":""},{"$f":"IF(Kalender!$I$33=\"\",\"\",Kalender!$I$33)","v":""},{"$f":"IF(Kalender!$I$34=\"\",\"\",Kalender!$I$34)","v":""},{"$f":"IF(Kalender!$I$36=\"\",\"\",Kalender!$I$36)","v":""},{"$f":"IF(Kalender!$I$34=\"\",\"\",Kalender!$I$34)","v":""},null,null,null,{"$f":"IF(Kalender!$I$39=\"\",\"\",Kalender!$I$39)","v":""},"Gespeeld","Volledige wedstrijd","Ingevallen","Gewisseld","Aanwezig niet gespeeld","Verwittigd","Niet verwittigd","Blessure","Schorsing","Schorsing maar aanwezig","Aantal speeldagen","% aanwezig"]
[null,{"$f":"Kalender!$F$6","v":"~"},{"$f":"Kalender!$F$6","v":"~"},{"$f":"Kalender!$F$6","v":"~"},{"$f":"Kalender!$F$6","v":"~"},{"$f":"Kalender!$F$6","v":"~"},{"$f":"Kalender!$F$6","v":"~"},{"$f":"Kalender!$F$6","v":"~"},{"$f":"Kalender!$F$6","v":"~"},{"$f":"Kalender!$F$6","v":"~"},{"$f":"Kalender!$F$6","v":"~"},{"$f":"Kalender!$F$6","v":"~"},{"$f":"Kalender!$F$6","v":"~"},{"$f":"Kalender!$F$6","v":"~"},{"$f":"Kalender!$F$6","v":"~"},{"$f":"Kalender!$F$6","v":"~"},{"$f":"Kalender!$F$6","v":"~"},{"$f":"Kalender!$F$6","v":"~"},{"$f":"Kalender!$F$6","v":"~"},{"$f":"Kalender!$F$6","v":"~"},{"$f":"Kalender!$F$6","v":"~"},{"$f":"Kalender!$F$6","v":"~"},{"$f":"Kalender!$F$6","v":"~"},{"$f":"Kalender!$F$6","v":"~"},{"$f":"Kalender!$F$6","v":"~"},{"$f":"Kalender!$F$6","v":"~"},{"$f":"Kalender!$F$6","v":"~"},{"$f":"Kalender!$F$6","v":"~"},{"$f":"Kalender!$F$6","v":"~"}]
[null,{"$f":"IF(Kalender!$H$5=\"\",\"\",Kalender!$H$5)","v":5},{"$f":"IF(Kalender!$H$6=\"\",\"\",Kalender!$H$6)","v":2},{"$f":"IF(Kalender!$H$7=\"\",\"\",Kalender!$H$7)","v":""},{"$f":"IF(Kalender!$H$9=\"\",\"\",Kalender!$H$9)","v":""},{"$f":"IF(Kalender!$H$10=\"\",\"\",Kalender!$H$10)","v":"Uitgesteld"},{"$f":"IF(Kalender!$H$11=\"\",\"\",Kalender!$H$11)","v":""},{"$f":"IF(Kalender!$H$12=\"\",\"\",Kalender!$H$12)","v":""},{"$f":"IF(Kalender!$H$13=\"\",\"\",Kalender!$H$13)","v":""},{"$f":"IF(Kalender!$H$14=\"\",\"\",Kalender!$H$14)","v":""},{"$f":"IF(Kalender!$H$15=\"\",\"\",Kalender!$H$15)","v":""},{"$f":"IF(Kalender!$H$16=\"\",\"\",Kalender!$H$16)","v":""},{"$f":"IF(Kalender!$H$17=\"\",\"\",Kalender!$H$17)","v":""},{"$f":"IF(Kalender!$H$18=\"\",\"\",Kalender!$H$18)","v":"Uitgesteld"},{"$f":"IF(Kalender!$H$36=\"\",\"\",Kalender!$H$36)","v":""},{"$f":"IF(Kalender!$H$38=\"\",\"\",Kalender!$H$38)","v":""},{"$f":"IF(Kalender!$H$25=\"\",\"\",Kalender!$H$25)","v":""},{"$f":"IF(Kalender!$H$28=\"\",\"\",Kalender!$H$28)","v":""},{"$f":"IF(Kalender!$H$29=\"\",\"\",Kalender!$H$29)","v":""},{"$f":"IF(Kalender!$H$31=\"\",\"\",Kalender!$H$31)","v":""},{"$f":"IF(Kalender!$H$32=\"\",\"\",Kalender!$H$32)","v":""},{"$f":"IF(Kalender!$H$33=\"\",\"\",Kalender!$H$33)","v":""},{"$f":"IF(Kalender!$H$34=\"\",\"\",Kalender!$H$34)","v":""},{"$f":"IF(Kalender!$H$36=\"\",\"\",Kalender!$H$36)","v":""},{"$f":"IF(Kalender!$H$34=\"\",\"\",Kalender!$H$34)","v":""},null,null,null,{"$f":"IF(Kalender!$H$39=\"\",\"\",Kalender!$H$39)","v":""}]
[null,{"$f":"Kalender!$E$5","v":"KWB Hombeek"},{"$f":"Kalender!$E$6","v":"KWB Putte"},{"$f":"Kalender!$E$7","v":"KWB Hombeek"},{"$f":"Kalender!$E$9","v":"KWB Hombeek"},{"$f":"Kalender!$E$10","v":"VK Wakkerzeel"},{"$f":"Kalender!$E$11","v":"KWB Hombeek"},{"$f":"Kalender!$E$12","v":"Vosberg Sport"},{"$f":"Kalender!$E$13","v":"FC Vilv Heverlee"},{"$f":"Kalender!$E$14","v":"KWB Hombeek"},{"$f":"Kalender!$E$15","v":"FC Blaasveld"},{"$f":"Kalender!$E$16","v":"KWB Hombeek"},{"$f":"Kalender!$E$17","v":"KWB Hombeek"},{"$f":"Kalender!$E$18","v":"Ludwina Bonheiden"},{"$f":"Kalender!$E$23","v":"VFL Malines"},{"$f":"Kalender!$E$24","v":"KWB Hombeek"},{"$f":"Kalender!$E$25","v":"Boerenb. Broechem"},{"$f":"Kalender!$E$28","v":"KWB Hombeek"},{"$f":"Kalender!$E$29","v":"VK Albatros"},{"$f":"Kalender!$E$31","v":"KWB Hombeek"},{"$f":"Kalender!$E$32","v":"Jamaswapi"},{"$f":"Kalender!$E$33","v":"KWB Hombeek"},{"$f":"Kalender!$E$34","v":"Plenke Werchter"},{"$f":"Kalender!$E$36","v":"KWB Hombeek"}]
[null,{"$f":"Kalender!$A$5","v":"2017-09-03"},{"$f":"Kalender!$A$6","v":"2017-09-10"},{"$f":"Kalender!$A$7","v":"2017-09-17"},{"$f":"Kalender!$A$9","v":"2017-10-01"},{"$f":"Kalender!$A$10","v":"2017-10-08"},{"$f":"Kalender!$A$11","v":"2017-10-15"},{"$f":"Kalender!$A$12","v":"2017-10-22"},{"$f":"Kalender!$A$13","v":"2017-10-29"},{"$f":"Kalender!$A$14","v":"2017-11-05"},{"$f":"Kalender!$A$15","v":"2017-11-12"},{"$f":"Kalender!$A$16","v":"2017-11-19"},{"$f":"Kalender!$A$17","v":"2017-11-26"},{"$f":"Kalender!$A$18","v":"2017-12-03"},{"$f":"Kalender!$A$23","v":"2018-01-07"},{"$f":"Kalender!$A$24","v":"2018-01-14"},{"$f":"Kalender!$A$25","v":"2018-01-21"},{"$f":"Kalender!$A$28","v":"2018-02-11"},{"$f":"Kalender!$A$29","v":"2018-02-18"},{"$f":"Kalender!$A$31","v":"2018-03-04"},{"$f":"Kalender!$A$32","v":"2018-03-11"},{"$f":"Kalender!$A$33","v":"2018-03-18"},{"$f":"Kalender!$A$34","v":"2018-03-25"},{"$f":"Kalender!$A$36","v":"2018-04-08"}]
["Addo Brian","N","N",null,null,null,null,null,null,null,null,null,null,null,null,null,null,null,null,null,null,null,null,null,null,null,null,null,null,{"$f":"SUM(AE8:AG8)","v":0},{"$f":"SUM(B8:AC8)","v":0},{"$f":"COUNTIF(B8:AC8,\"i\")","v":0},{"$f":"COUNTIF(B8:AC8,\"g\")","v":0},{"$f":"COUNTIF(B8:AC8,\"a\")","v":0},{"$f":"COUNTIF(B8:AC8,\"v\")","v":0},{"$f":"COUNTIF(B8:AC8,\"n\")","v":2},{"$f":"COUNTIF(B8:AC8,\"b\")","v":0},{"$f":"COUNTIF(B8:AC8,\"s\")","v":0},{"$f":"COUNTIF(C8:AD8,\"Z\")","v":0},{"$f":"($B$47-(COUNTIF(B8:AC8,\"L\"))-(COUNTIF(B8:AC8,\"B\")))","v":2},{"$f":"SUM(((AD8+AH8+AM8)/AN8)*100)","v":0}]
["Beeckmans Sander","B","B",null,null,null,null,null,null,null,null,null,null,null,null,null,null,null,null,null,null,null,null,null,null,null,null,null,null,{"$f":"SUM(AE9:AG9)","v":0},{"$f":"SUM(B9:AC9)","v":0},{"$f":"COUNTIF(B9:AC9,\"i\")","v":0},{"$f":"COUNTIF(B9:AC9,\"g\")","v":0},{"$f":"COUNTIF(B9:AC9,\"a\")","v":0},{"$f":"COUNTIF(B9:AC9,\"v\")","v":0},{"$f":"COUNTIF(B9:AC9,\"n\")","v":0},{"$f":"COUNTIF(B9:AC9,\"b\")","v":2},{"$f":"COUNTIF(B9:AC9,\"s\")","v":0},{"$f":"COUNTIF(C9:AD9,\"Z\")","v":0},0,{"$f":"SUM(((AD9+AH9+AM9)/AN9)*100)","v":{"$error":"#DIV/0!"}}]
["Beeckmans Thomas",1,1,null,null,null,null,null,null,null,null,null,null,null,null,null,null,null,null,null,null,null,null,null,null,null,null,null,null,2,2,0,0,0,0,0,0,0,0,2,100]
["Begine Bob","V ","A","V ","V ","V ","V ","V ","V ","V ","V ","V ","V ","V ","V ","V ","V ","V ","V ","V ","V ","V ","V ","V ",null,null,null,null,null,0,0,0,0,1,0,0,0,0,0,2,50]
["Cortebeeck Glenn",1,1,null,null,null,null,null,null,null,null,null,null,null,null,null,null,null,null,null,null,null,null,null,null,null,null,null,null,2,2,0,0,0,0,0,0,0,0,2,100]
["De Buyser Gert",1,"G",null,null,null,null,null,null,null,null,null,null,null,null,null,null,null,null,null,null,null,null,null,null,null,null,null,null,2,1,0,1,0,0,0,0,0,0,2,100]
["De Cock Michaël",1,"G",null,null,null,null,null,null,null,null,null,null,null,null,null,null,null,null,null,null,null,null,null,null,null,null,null,null,2,1,0,1,0,0,0,0,0,0,2,100]
["De Haes Wim","V","V","V","V","V","V","V","V","V","V","V","V","V","V","V","V","V","V","V","V","V","V","V",null,null,null,null,null,0,0,0,0,0,23,0,0,0,0,2,0]
["El Azzouzi Ahmed",1,"G",null,null,null,null,null,null,null,null,null,null,null,null,null,null,null,null,null,null,null,null,null,null,null,null,null,null,2,1,0,1,0,0,0,0,0,0,2,100]
["Gijsen Angelo","B","B",null,null,null,null,null,null,null,null,null,null,null,null,null,null,null,null,null,null,null,null,null,null,null,null,null,null,0,{"$f":"SUM(B17:AC17)","v":0},{"$f":"COUNTIF(B17:AC17,\"i\")","v":0},{"$f":"COUNTIF(B17:AC17,\"g\")","v":0},{"$f":"COUNTIF(B17:AC17,\"a\")","v":0},{"$f":"COUNTIF(B17:AC17,\"v\")","v":0},{"$f":"COUNTIF(B17:AC17,\"n\")","v":0},{"$f":"COUNTIF(B17:AC17,\"b\")","v":2},{"$f":"COUNTIF(B17:AC17,\"s\")","v":0},0,0,{"$error":"#DIV/0!"}]
["Goossens Stijn","V","V","V","V","V","V","V","V","V","V","V","V","V","V","V","V","V","V","V","V","V","V","V",null,null,null,null,null,0,{"$f":"SUM(B18:AC18)","v":0},{"$f":"COUNTIF(B18:AC18,\"i\")","v":0},{"$f":"COUNTIF(B18:AC18,\"g\")","v":0},{"$f":"COUNTIF(B18:AC18,\"a\")","v":0},{"$f":"COUNTIF(B18:AC18,\"v\")","v":23},{"$f":"COUNTIF(B18:AC18,\"n\")","v":0},{"$f":"COUNTIF(B18:AC18,\"b\")","v":0},{"$f":"COUNTIF(B18:AC18,\"s\")","v":0},0,2,0]
["Goovaerts Hans","V","V","V","V","V","V","V","V","V","V","V","V","V","V","V","V","V","V","V","V","V","V","V",null,null,null,null,null,0,0,0,0,0,23,0,0,0,0,2,0]
["Jarray Imed","V","V",null,null,null,null,null,null,null,null,null,null,null,null,null,null,null,null,null,null,null,null,null,null,null,null,null,null,0,0,0,0,0,2,0,0,0,0,2,0]
["Mayembi Yves",1,"G",null,null,null,null,null,null,null,null,null,null,null,null,null,null,null,null,null,null,null,null,null,null,null,null,null,null,{"$f":"SUM(AE21:AG21)","v":2},{"$f":"SUM(B21:AC21)","v":1},{"$f":"COUNTIF(B21:AC21,\"i\")","v":0},{"$f":"COUNTIF(B21:AC21,\"g\")","v":1},{"$f":"COUNTIF(B21:AC21,\"a\")","v":0},{"$f":"COUNTIF(B21:AC21,\"v\")","v":0},{"$f":"COUNTIF(B21:AC21,\"n\")","v":0},{"$f":"COUNTIF(B21:AC21,\"b\")","v":0},{"$f":"COUNTIF(B21:AC21,\"s\")","v":0},{"$f":"COUNTIF(C21:AD21,\"Z\")","v":0},2,{"$f":"SUM(((AD21+AH21+AM21)/AN21)*100)","v":100}]
["Noppen Jochem","A","I",null,null,null,null,null,null,null,null,null,null,null,null,null,null,null,null,null,null,null,null,null,null,null,null,null,null,1,{"$f":"SUM(B22:AC22)","v":0},{"$f":"COUNTIF(B22:AC22,\"i\")","v":1},{"$f":"COUNTIF(B22:AC22,\"g\")","v":0},{"$f":"COUNTIF(B22:AC22,\"a\")","v":1},{"$f":"COUNTIF(B22:AC22,\"v\")","v":0},{"$f":"COUNTIF(B22:AC22,\"n\")","v":0},{"$f":"COUNTIF(B22:AC22,\"b\")","v":0},{"$f":"COUNTIF(B22:AC22,\"s\")","v":0},0,2,100]
["Pollenus Youri",1,"G",null,null,null,null,null,null,null,null,null,null,null,null,null,null,null,null,null,null,null,null,null,null,null,null,null,null,{"$f":"SUM(AE23:AG23)","v":2},{"$f":"SUM(B23:AC23)","v":1},{"$f":"COUNTIF(B23:AC23,\"i\")","v":0},{"$f":"COUNTIF(B23:AC23,\"g\")","v":1},{"$f":"COUNTIF(B23:AC23,\"a\")","v":0},{"$f":"COUNTIF(B23:AC23,\"v\")","v":0},{"$f":"COUNTIF(B23:AC23,\"n\")","v":0},{"$f":"COUNTIF(B23:AC23,\"b\")","v":0},{"$f":"COUNTIF(B23:AC23,\"s\")","v":0},{"$f":"COUNTIF(C23:AD23,\"Z\")","v":0},2,{"$f":"SUM(((AD23+AH23+AM23)/AN23)*100)","v":100}]
["Reyniers Peter","V","V","V","V","V","V","V","V","V","V","V","V","V","V","V","V","V","V","V","V","V","V","V",null,null,null,null,null,0,0,0,0,0,23,0,0,0,0,2,0]
["Roosen Mark","B","B","B","B","B","B","B","B","B","B","B","B","B","B","B","B","B","B","B","B","B","B","B",null,null,null,null,null,0,0,0,0,0,0,0,23,0,0,-21,0]
["Soli Peter","V",1,"  "," "," "," "," "," "," "," "," "," "," "," "," "," "," "," "," "," "," "," "," ",null,null,null,null,null,1,1,0,0,0,1,0,0,0,0,2,50]
["Steens Alexander","V","V","V","V","V","V","V","V","V","V","V","V","V","V","V","V","V","V","V","V","V","V","V",null,null,null,null,null,0,0,0,0,0,23,0,0,0,0,2,0]
["Tariku Habel","V","I",null,null,null,null,null,null,null,null,null,null,null,null,null,null,null,null,null,null,null,null,null,null,null,null,null,null,1,{"$f":"SUM(B28:AC28)","v":0},{"$f":"COUNTIF(B28:AC28,\"i\")","v":1},{"$f":"COUNTIF(B28:AC28,\"g\")","v":0},{"$f":"COUNTIF(B28:AC28,\"a\")","v":0},{"$f":"COUNTIF(B28:AC28,\"v\")","v":1},{"$f":"COUNTIF(B28:AC28,\"n\")","v":0},{"$f":"COUNTIF(B28:AC28,\"b\")","v":0},{"$f":"COUNTIF(B28:AC28,\"s\")","v":0},0,2,50]
["Teck Jan",1,"I",null,null,null,null,null,null,null,null,null,null,null,null,null,null,null,null,null,null,null,null,null,null,null,null,null,null,2,1,1,0,0,0,0,0,0,0,2,100]
["Troch Wesley",1,1,null,null,null,null,null,null,null,null,null,null,null,null,null,null,null,null,null,null,null,null,null,null,null,null,null,null,2,2,0,0,0,0,0,0,0,0,2,100]
["Van Winghe Niels","N","N",null,null,null,null,null,null,null,null,null,null,null,null,null,null,null,null,null,null,null,null,null,null,null,null,null,null,0,0,0,0,0,0,2,0,0,0,2,0]
["Vanmeerbeeck Jonas","A","I",null,null,null,null,null,null,null,null,null,null,null,null,null,null,null,null,null,null,null,null,null,null,null,null,null,null,1,0,1,0,1,0,0,0,0,0,2,100]
["Vercammen Bart","A","A",null,null,null,null,null,null,null,null,null,null,null,null,null,null,null,null,null,null,null,null,null,null,null,null,null,null,0,0,{"$f":"COUNTIF(B33:AC33,\"i\")","v":0},{"$f":"COUNTIF(B33:AC33,\"g\")","v":0},{"$f":"COUNTIF(B33:AC33,\"a\")","v":2},{"$f":"COUNTIF(B33:AC33,\"v\")","v":0},{"$f":"COUNTIF(B33:AC33,\"n\")","v":0},{"$f":"COUNTIF(B33:AC33,\"b\")","v":0},{"$f":"COUNTIF(B33:AC33,\"s\")","v":0},0,2,100]
["Vermeeren Kevin",1,1,null,null,null,null,null,null,null,null,null,null,null,null,null,null,null,null,null,null,null,null,null,null,null,null,null,null,2,2,0,0,0,0,0,0,0,0,2,100]
["Vlaeminck Dimitri","L","I",null,null,null,null,null,null,null,null,null,null,null,null,null,null,null,null,null,null,null,null,null,null,null,null,null,null,{"$f":"SUM(AE35:AG35)","v":1},{"$f":"SUM(B35:AC35)","v":0},{"$f":"COUNTIF(B35:AC35,\"i\")","v":1},{"$f":"COUNTIF(B35:AC35,\"g\")","v":0},{"$f":"COUNTIF(B35:AC35,\"a\")","v":0},{"$f":"COUNTIF(B35:AC35,\"v\")","v":0},{"$f":"COUNTIF(B35:AC35,\"n\")","v":0},{"$f":"COUNTIF(B35:AC35,\"b\")","v":0},{"$f":"COUNTIF(B35:AC35,\"s\")","v":0},{"$f":"COUNTIF(C35:AD35,\"Z\")","v":0},1,{"$f":"SUM(((AD35+AH35+AM35)/AN35)*100)","v":100}]
["Wellens Nico","N","V","V","V",null,null,null,null,null,null,null,null,null,null,null,null,null,null,null,null,null,null,null,null,null,null,null,null,0,0,0,0,0,3,1,0,0,0,2,0]
["Windelen Robbie","V","V","V","V","V","V","V","V","V","V","V","V","V","V","V","V","V","V","V","V","V","V","V",null,null,null,null,null,0,0,0,0,0,23,0,0,0,0,2,0]
["Wouters Kristof",1,1,null,null,null,null,null,null,null,null,null,null,null,null,null,null,null,null,null,null,null,null,null,null,null,null,null,null,2,2,0,0,0,0,0,0,0,0,2,100]
["# spelers",{"$f":"SUM(B8:B38,B40:B41)","v":11},16,0,0,0,0,0,0,0,0,0,0,0,0,0,0,0,0,0,0,0,0,0,0,0,0,0,0]
["# ingevallen spelers",{"$f":"COUNTIF(B$8:B$38,\"I\")","v":0},5,0,0,0,0,0,0,0,0,0,0,0,0,0,0,0,0,0,0,0,0,0,0,0,0,0,0]
["# gewisselde spelers",{"$f":"COUNTIF(B$8:B$38,\"G\")","v":0},5,0,0,0,0,0,0,0,0,0,0,0,0,0,0,0,0,0,0,0,0,0,0,0,0,0,0]
["# aanwezig niet gespeeld",{"$f":"COUNTIF(B$8:B$38,\"A\")","v":3},2,0,0,0,0,0,0,0,0,0,0,0,0,0,0,0,0,0,0,0,0,0,0,0,0,0,0]
["# verwittigd",{"$f":"COUNTIF(B$8:B$38,\"V\")","v":9},{"$f":"COUNTIF(C$8:C$37,\"V\")","v":8},7,7,6,6,6,6,6,6,6,6,6,6,6,6,6,6,6,6,6,6,6,0,0,0,0,0]
["# niet verwittigd",{"$f":"COUNTIF(B$8:B$38,\"N\")","v":3},2,0,0,0,0,0,0,0,0,0,0,0,0,0,0,0,0,0,0,0,0,0,0,0,0,0,0]
["# aanwezigen",{"$f":"SUM(B39+B42)","v":14},{"$f":"SUM(C39+C42)","v":18},0,0,{"$f":"SUM(F39+F42)","v":0},0,0,0,0,0,0,0,0,0,0,0,0,0,{"$f":"SUM(T39+T42)","v":0},0,0,0,0,0,0,{"$f":"SUM(AA39+AA42)","v":0},0,0]
[]
["Bijwerking na speeldag : ",{"$f":"SUM(28-(COUNTIF(B3:AC3,\"\")))","v":2},null,1,"Volledige wedstrijd",null,null,null,null,null,null,"I","Ingevallen",null,null,null,null,null,null,"G","Gewisseld"]
[null,null,null,"A","Aanwezig niet gespeeld",null,null,null,null,null,null,"V","Verwittigd",null,null,null,null,null,null,"N","Niet verwittigd"]
[null,null,null,"B","Blessure (min. 2 speeldagen)",null,null,null,null,null,null,"S","Schorsing geel/rood",null,null,null,null,null,null,"Z","Schorsing maar aanwezig"]
[null,null,null,"L","Later aangesloten"]

{"sheet":"Goals","index":2,"n_rows":40,"n_cols":31,"rows_kept":40,"cut":false,"hidden":false,"merged":[[2,31,6,31],[0,0,0,31],[2,29,6,29],[2,30,6,30]]}
["Goals seizoen 2017-2018"]
[null,{"$f":"Kalender!$G$5","v":"VFL Malines"},{"$f":"Kalender!$G$6","v":"KWB Hombeek"},{"$f":"Kalender!$G$7","v":"Boerenb. Broechem"},{"$f":"Kalender!$G$9","v":"FC Vilv Heverlee"},{"$f":"Kalender!$G$10","v":"KWB Hombeek"},{"$f":"Kalender!$G$11","v":"VK Albatros"},{"$f":"Kalender!$G$12","v":"KWB Hombeek"},{"$f":"Kalender!$G$13","v":"KWB Hombeek"},{"$f":"Kalender!$G$14","v":"Jamaswapi"},{"$f":"Kalender!$G$15","v":"KWB Hombeek"},{"$f":"Kalender!$G$16","v":"Plenke Werchter"},{"$f":"Kalender!$G$17","v":"VVS Rotselaar"},{"$f":"Kalender!$G$18","v":"KWB Hombeek"},{"$f":"Kalender!$G$23","v":"KWB Hombeek"},{"$f":"Kalender!$G$24","v":"KWB Putte"},{"$f":"Kalender!$G$25","v":"KWB Hombeek"},{"$f":"Kalender!$G$28","v":"VK Wakkerzeel"},{"$f":"Kalender!$G$29","v":"KWB Hombeek"},{"$f":"Kalender!$G$31","v":"Vosberg Sport"},{"$f":"Kalender!$G$32","v":"KWB Hombeek"},{"$f":"Kalender!$G$33","v":"FC Blaasveld"},{"$f":"Kalender!$G$34","v":"KWB Hombeek"},{"$f":"Kalender!$G$36","v":"Ludwina Bonheiden"}]
[null,{"$f":"IF(Kalender!$I$5=\"\",\"\",Kalender!$I$5)","v":0},{"$f":"IF(Kalender!$I$6=\"\",\"\",Kalender!$I$6)","v":5},{"$f":"IF(Kalender!$I$7=\"\",\"\",Kalender!$I$7)","v":""},{"$f":"IF(Kalender!$I$9=\"\",\"\",Kalender!$I$9)","v":""},{"$f":"IF(Kalender!$I$10=\"\",\"\",Kalender!$I$10)","v":""},{"$f":"IF(Kalender!$I$11=\"\",\"\",Kalender!$I$11)","v":""},{"$f":"IF(Kalender!$I$12=\"\",\"\",Kalender!$I12)","v":""},{"$f":"IF(Kalender!$I$13=\"\",\"\",Kalender!$I$13)","v":""},{"$f":"IF(Kalender!$I$14=\"\",\"\",Kalender!$I$14)","v":""},{"$f":"IF(Kalender!$I$15=\"\",\"\",Kalender!$I$15)","v":""},{"$f":"IF(Kalender!$I$16=\"\",\"\",Kalender!$I$16)","v":""},{"$f":"IF(Kalender!$I$17=\"\",\"\",Kalender!$I$17)","v":""},{"$f":"IF(Kalender!$I$18=\"\",\"\",Kalender!$I$18)","v":""},{"$f":"IF(Kalender!$I$36=\"\",\"\",Kalender!$I$36)","v":""},{"$f":"IF(Kalender!$I$38=\"\",\"\",Kalender!$I$38)","v":""},{"$f":"IF(Kalender!$I$25=\"\",\"\",Kalender!$I$25)","v":""},{"$f":"IF(Kalender!$I$28=\"\",\"\",Kalender!$I$28)","v":""},{"$f":"IF(Kalender!$I$29=\"\",\"\",Kalender!$I$29)","v":""},{"$f":"IF(Kalender!$I$31=\"\",\"\",Kalender!$I$31)","v":""},{"$f":"IF(Kalender!$I$32=\"\",\"\",Kalender!$I$32)","v":""},{"$f":"IF(Kalender!$I$33=\"\",\"\",Kalender!$I$33)","v":""},{"$f":"IF(Kalender!$I$34=\"\",\"\",Kalender!$I$34)","v":""},{"$f":"IF(Kalender!$I$36=\"\",\"\",Kalender!$I$36)","v":""},{"$f":"IF(Kalender!$I$34=\"\",\"\",Kalender!$I$34)","v":""},null,null,null,{"$f":"Aanwezig!AC3","v":""},null,"Goals"]
[null,{"$f":"Aanwezig!B4","v":"~"},{"$f":"Aanwezig!C4","v":"~"},{"$f":"Aanwezig!D4","v":"~"},{"$f":"Aanwezig!E4","v":"~"},{"$f":"Aanwezig!F4","v":"~"},{"$f":"Aanwezig!G4","v":"~"},{"$f":"Aanwezig!H4","v":"~"},{"$f":"Aanwezig!I4","v":"~"},{"$f":"Aanwezig!J4","v":"~"},{"$f":"Aanwezig!K4","v":"~"},{"$f":"Aanwezig!L4","v":"~"},{"$f":"Aanwezig!M4","v":"~"},{"$f":"Aanwezig!N4","v":"~"},{"$f":"Aanwezig!O4","v":"~"},{"$f":"Aanwezig!P4","v":"~"},{"$f":"Aanwezig!Q4","v":"~"},{"$f":"Aanwezig!R4","v":"~"},{"$f":"Aanwezig!S4","v":"~"},{"$f":"Aanwezig!T4","v":"~"},{"$f":"Aanwezig!U4","v":"~"},{"$f":"Aanwezig!V4","v":"~"},{"$f":"Aanwezig!W4","v":"~"},{"$f":"Aanwezig!X4","v":"~"},{"$f":"Aanwezig!Y4","v":"~"},{"$f":"Aanwezig!Z4","v":"~"},{"$f":"Aanwezig!AA4","v":"~"},{"$f":"Aanwezig!AB4","v":"~"},{"$f":"Aanwezig!AC4","v":"~"}]
[null,{"$f":"IF(Kalender!$H$5=\"\",\"\",Kalender!$H$5)","v":5},{"$f":"IF(Kalender!$H$6=\"\",\"\",Kalender!$H$6)","v":2},{"$f":"IF(Kalender!$H$7=\"\",\"\",Kalender!$H$7)","v":""},{"$f":"IF(Kalender!$H$9=\"\",\"\",Kalender!$H$9)","v":""},{"$f":"IF(Kalender!$H$10=\"\",\"\",Kalender!$H$10)","v":"Uitgesteld"},{"$f":"IF(Kalender!$H$11=\"\",\"\",Kalender!$H$11)","v":""},{"$f":"IF(Kalender!$H$12=\"\",\"\",Kalender!$H$12)","v":""},{"$f":"IF(Kalender!$H$13=\"\",\"\",Kalender!$H$13)","v":""},{"$f":"IF(Kalender!$H$14=\"\",\"\",Kalender!$H$14)","v":""},{"$f":"IF(Kalender!$H$15=\"\",\"\",Kalender!$H$15)","v":""},{"$f":"IF(Kalender!$H$16=\"\",\"\",Kalender!$H$16)","v":""},{"$f":"IF(Kalender!$H$17=\"\",\"\",Kalender!$H$17)","v":""},{"$f":"IF(Kalender!$H$18=\"\",\"\",Kalender!$H$18)","v":"Uitgesteld"},{"$f":"IF(Kalender!$H$36=\"\",\"\",Kalender!$H$36)","v":""},{"$f":"IF(Kalender!$H$38=\"\",\"\",Kalender!$H$38)","v":""},{"$f":"IF(Kalender!$H$25=\"\",\"\",Kalender!$H$25)","v":""},{"$f":"IF(Kalender!$H$28=\"\",\"\",Kalender!$H$28)","v":""},{"$f":"IF(Kalender!$H$29=\"\",\"\",Kalender!$H$29)","v":""},{"$f":"IF(Kalender!$H$31=\"\",\"\",Kalender!$H$31)","v":""},{"$f":"IF(Kalender!$H$32=\"\",\"\",Kalender!$H$32)","v":""},{"$f":"IF(Kalender!$H$33=\"\",\"\",Kalender!$H$33)","v":""},{"$f":"IF(Kalender!$H$34=\"\",\"\",Kalender!$H$34)","v":""},{"$f":"IF(Kalender!$H$36=\"\",\"\",Kalender!$H$36)","v":""},{"$f":"IF(Kalender!$H$34=\"\",\"\",Kalender!$H$34)","v":""},null,null,null,{"$f":"Aanwezig!AC5","v":""}]
[null,{"$f":"Kalender!$E$5","v":"KWB Hombeek"},{"$f":"Kalender!$E$6","v":"KWB Putte"},{"$f":"Kalender!$E$7","v":"KWB Hombeek"},{"$f":"Kalender!$E$9","v":"KWB Hombeek"},{"$f":"Kalender!$E$10","v":"VK Wakkerzeel"},{"$f":"Kalender!$E$11","v":"KWB Hombeek"},{"$f":"Kalender!$E$12","v":"Vosberg Sport"},{"$f":"Kalender!$E$13","v":"FC Vilv Heverlee"},{"$f":"Kalender!$E$14","v":"KWB Hombeek"},{"$f":"Kalender!$E$15","v":"FC Blaasveld"},{"$f":"Kalender!$E$16","v":"KWB Hombeek"},{"$f":"Kalender!$E$17","v":"KWB Hombeek"},{"$f":"Kalender!$E$18","v":"Ludwina Bonheiden"},{"$f":"Kalender!$E$23","v":"VFL Malines"},{"$f":"Kalender!$E$24","v":"KWB Hombeek"},{"$f":"Kalender!$E$25","v":"Boerenb. Broechem"},{"$f":"Kalender!$E$28","v":"KWB Hombeek"},{"$f":"Kalender!$E$29","v":"VK Albatros"},{"$f":"Kalender!$E$31","v":"KWB Hombeek"},{"$f":"Kalender!$E$32","v":"Jamaswapi"},{"$f":"Kalender!$E$33","v":"KWB Hombeek"},{"$f":"Kalender!$E$34","v":"Plenke Werchter"},{"$f":"Kalender!$E$36","v":"KWB Hombeek"}]
[null,{"$f":"Kalender!$A$5","v":"2017-09-03"},{"$f":"Kalender!$A$6","v":"2017-09-10"},{"$f":"Kalender!$A$7","v":"2017-09-17"},{"$f":"Kalender!$A$9","v":"2017-10-01"},{"$f":"Kalender!$A$10","v":"2017-10-08"},{"$f":"Kalender!$A$11","v":"2017-10-15"},{"$f":"Kalender!$A$12","v":"2017-10-22"},{"$f":"Kalender!$A$13","v":"2017-10-29"},{"$f":"Kalender!$A$14","v":"2017-11-05"},{"$f":"Kalender!$A$15","v":"2017-11-12"},{"$f":"Kalender!$A$16","v":"2017-11-19"},{"$f":"Kalender!$A$17","v":"2017-11-26"},{"$f":"Kalender!$A$18","v":"2017-12-03"},{"$f":"Kalender!$A$23","v":"2018-01-07"},{"$f":"Kalender!$A$24","v":"2018-01-14"},{"$f":"Kalender!$A$25","v":"2018-01-21"},{"$f":"Kalender!$A$28","v":"2018-02-11"},{"$f":"Kalender!$A$29","v":"2018-02-18"},{"$f":"Kalender!$A$31","v":"2018-03-04"},{"$f":"Kalender!$A$32","v":"2018-03-11"},{"$f":"Kalender!$A$33","v":"2018-03-18"},{"$f":"Kalender!$A$34","v":"2018-03-25"},{"$f":"Kalender!$A$36","v":"2018-04-08"}]
["Addo Brian",null,null,null,null,null,null,null,null,null,null,null,null,null,null,null,null,null,null,null,null,null,null,null,null,null,null,null,null,null,{"$f":"SUM(B8:AC8)","v":0}]
["Beeckmans Sander",null,null,null,null,null,null,null,null,null,null,null,null,null,null,null,null,null,null,null,null,null,null,null,null,null,null,null,null,null,0]
["Beeckmans Thomas",null,null,null,null,null,null,null,null,null,null,null,null,null,null,null,null,null,null,null,null,null,null,null,null,null,null,null,null,null,0]
["Begine Bob",null,null,null,null,null,null,null,null,null,null,null,null,null,null,null,null,null,null,null,null,null,null,null,null,null,null,null,null,null,0]
["Cortebeeck Glenn",null,null,null,null,null,null,null,null,null,null,null,null,null,null,null,null,null,null,null,null,null,null,null,null,null,null,null,null,null,0]
["De Buyser Gert",null,null,null,null,null,null,null,null,null,null,null,null,null,null,null,null,null,null,null,null,null,null,null,null,null,null,null,null,null,0]
["De Cock Michael",1,1,null,null,null,null,null,null,null,null,null,null,null,null,null,null,null,null,null,null,null,null,null,null,null,null,null,null,null,2]
["De Haes Wim",null,null,null,null,null,null,null,null,null,null,null,null,null,null,null,null,null,null,null,null,null,null,null,null,null,null,null,null,null,0]
["El Azzouzi Ahmed",null,null,null,null,null,null,null,null,null,null,null,null,null,null,null,null,null,null,null,null,null,null,null,null,null,null,null,null,null,0]
["Gijsen Angelo",null,null,null,null,null,null,null,null,null,null,null,null,null,null,null,null,null,null,null,null,null,null,null,null,null,null,null,null,null,{"$f":"SUM(B17:AC17)","v":0}]
["Goossens Stijn",null,null,null,null,null,null,null,null,null,null,null,null,null,null,null,null,null,null,null,null,null,null,null,null,null,null,null,null,null,0]
["Goovaerts Hans",null,null,null,null,null,null,null,null,null,null,null,null,null,null,null,null,null,null,null,null,null,null,null,null,null,null,null,null,null,0]
["Jarray Imed",null,null,null,null,null,null,null,null,null,null,null,null,null,null,null,null,null,null,null,null,null,null,null,null,null,null,null,null,null,0]
["Mayembi Yves",null,null,null,null,null,null,null,null,null,null,null,null,null,null,null,null,null,null,null,null,null,null,null,null,null,null,null,null,null,0]
["Noppen Jochem",null,null,null,null,null,null,null,null,null,null,null,null,null,null,null,null,null,null,null,null,null,null,null,null,null,null,null,null,null,0]
["Pollenus Youri",null,null,null,null,null,null,null,null,null,null,null,null,null,null,null,null,null,null,null,null,null,null,null,null,null,null,null,null,null,0]
["Reyniers Peter",null,null,null,null,null,null,null,null,null,null,null,null,null,null,null,null,null,null,null,null,null,null,null,null,null,null,null,null,null,0]
["Roosen Mark",null,null,null,null,null,null,null,null,null,null,null,null,null,null,null,null,null,null,null,null,null,null,null,null,null,null,null,null,null,{"$f":"SUM(B25:AC25)","v":0}]
["Soli Peter",null,1,null,null,null,null,null,null,null,null,null,null,null,null,null,null,null,null,null,null,null,null,null,null,null,null,null,null,null,1]
["Steens Alexander",null,null,null,null,null,null,null,null,null,null,null,null,null,null,null,null,null,null,null,null,null,null,null,null,null,null,null,null,null,0]
["Tariku Habel",null,null,null,null,null,null,null,null,null,null,null,null,null,null,null,null,null,null,null,null,null,null,null,null,null,null,null,null,null,0]
["Teck Jan",null,null,null,null,null,null,null,null,null,null,null,null,null,null,null,null,null,null,null,null,null,null,null,null,null,null,null,null,null,0]
["Troch Wesley",null,2,null,null,null,null,null,null,null,null,null,null,null,null,null,null,null,null,null,null,null,null,null,null,null,null,null,null,null,2]
["Van Winghe Niels",null,null,null,null,null,null,null,null,null,null,null,null,null,null,null,null,null,null,null,null,null,null,null,null,null,null,null,null,null,0]
["Vanmeerbeeck Jonas",null,null,null,null,null,null,null,null,null,null,null,null,null,null,null,null,null,null,null,null,null,null,null,null,null,null,null,null,null,0]
["Vercammen Bart",null,null,null,null,null,null,null,null,null,null,null,null,null,null,null,null,null,null,null,null,null,null,null,null,null,null,null,null,null,0]
["Vermeeren Kevin",null,null,null,null,null,null,null,null,null,null,null,null,null,null,null,null,null,null,null,null,null,null,null,null,null,null,null,null,null,0]
["Vlaeminck Dimitri",null,null,null,null,null,null,null,null,null,null,null,null,null,null,null,null,null,null,null,null,null,null,null,null,null,null,null,null,null,0]
["Wellens Nico",null,null,null,null,null,null,null,null,null,null,null,null,null,null,null,null,null,null,null,null,null,null,null,null,null,null,null,null,null,0]
["Windelen Robbie",null,null,null,null,null,null,null,null,null,null,null,null,null,null,null,null,null,null,null,null,null,null,null,null,null,null,null,null,null,0]
["Wouters Kristof",null,1,null,null,null,null,null,null,null,null,null,null,null,null,null,null,null,null,null,null,null,null,null,null,null,null,null,null,null,1]
[]
["Totaal goals",{"$f":"SUM(B8:B38)","v":1},5,0,0,0,0,0,0,0,0,0,0,0,0,0,0,0,0,0,0,0,0,0,0,0,0,0,0]

{"sheet":"Assists","index":3,"n_rows":40,"n_cols":31,"rows_kept":40,"cut":false,"hidden":false,"merged":[[2,31,6,31],[0,0,0,31],[2,29,6,29],[2,30,6,30]]}
["Assists seizoen 2017-2018"]
[null,{"$f":"Kalender!$G$5","v":"VFL Malines"},{"$f":"Kalender!$G$6","v":"KWB Hombeek"},{"$f":"Kalender!$G$7","v":"Boerenb. Broechem"},{"$f":"Kalender!$G$9","v":"FC Vilv Heverlee"},{"$f":"Kalender!$G$10","v":"KWB Hombeek"},{"$f":"Kalender!$G$11","v":"VK Albatros"},{"$f":"Kalender!$G$12","v":"KWB Hombeek"},{"$f":"Kalender!$G$13","v":"KWB Hombeek"},{"$f":"Kalender!$G$14","v":"Jamaswapi"},{"$f":"Kalender!$G$15","v":"KWB Hombeek"},{"$f":"Kalender!$G$16","v":"Plenke Werchter"},{"$f":"Kalender!$G$17","v":"VVS Rotselaar"},{"$f":"Kalender!$G$18","v":"KWB Hombeek"},{"$f":"Kalender!$G$23","v":"KWB Hombeek"},{"$f":"Kalender!$G$24","v":"KWB Putte"},{"$f":"Kalender!$G$25","v":"KWB Hombeek"},{"$f":"Kalender!$G$28","v":"VK Wakkerzeel"},{"$f":"Kalender!$G$29","v":"KWB Hombeek"},{"$f":"Kalender!$G$31","v":"Vosberg Sport"},{"$f":"Kalender!$G$32","v":"KWB Hombeek"},{"$f":"Kalender!$G$33","v":"FC Blaasveld"},{"$f":"Kalender!$G$34","v":"KWB Hombeek"},{"$f":"Kalender!$G$36","v":"Ludwina Bonheiden"}]
[null,{"$f":"IF(Kalender!$I$5=\"\",\"\",Kalender!$I$5)","v":0},{"$f":"IF(Kalender!$I$6=\"\",\"\",Kalender!$I$6)","v":5},{"$f":"IF(Kalender!$I$7=\"\",\"\",Kalender!$I$7)","v":""},{"$f":"IF(Kalender!$I$9=\"\",\"\",Kalender!$I$9)","v":""},{"$f":"IF(Kalender!$I$10=\"\",\"\",Kalender!$I$10)","v":""},{"$f":"IF(Kalender!$I$11=\"\",\"\",Kalender!$I$11)","v":""},{"$f":"IF(Kalender!$I$12=\"\",\"\",Kalender!$I12)","v":""},{"$f":"IF(Kalender!$I$13=\"\",\"\",Kalender!$I$13)","v":""},{"$f":"IF(Kalender!$I$14=\"\",\"\",Kalender!$I$14)","v":""},{"$f":"IF(Kalender!$I$15=\"\",\"\",Kalender!$I$15)","v":""},{"$f":"IF(Kalender!$I$16=\"\",\"\",Kalender!$I$16)","v":""},{"$f":"IF(Kalender!$I$17=\"\",\"\",Kalender!$I$17)","v":""},{"$f":"IF(Kalender!$I$18=\"\",\"\",Kalender!$I$18)","v":""},{"$f":"IF(Kalender!$I$36=\"\",\"\",Kalender!$I$36)","v":""},{"$f":"IF(Kalender!$I$38=\"\",\"\",Kalender!$I$38)","v":""},{"$f":"IF(Kalender!$I$25=\"\",\"\",Kalender!$I$25)","v":""},{"$f":"IF(Kalender!$I$28=\"\",\"\",Kalender!$I$28)","v":""},{"$f":"IF(Kalender!$I$29=\"\",\"\",Kalender!$I$29)","v":""},{"$f":"IF(Kalender!$I$31=\"\",\"\",Kalender!$I$31)","v":""},{"$f":"IF(Kalender!$I$32=\"\",\"\",Kalender!$I$32)","v":""},{"$f":"IF(Kalender!$I$33=\"\",\"\",Kalender!$I$33)","v":""},{"$f":"IF(Kalender!$I$34=\"\",\"\",Kalender!$I$34)","v":""},{"$f":"IF(Kalender!$I$36=\"\",\"\",Kalender!$I$36)","v":""},{"$f":"IF(Kalender!$I$34=\"\",\"\",Kalender!$I$34)","v":""},null,null,null,{"$f":"Aanwezig!AC3","v":""},null,"Assists"]
[null,{"$f":"Aanwezig!B4","v":"~"},{"$f":"Aanwezig!C4","v":"~"},{"$f":"Aanwezig!D4","v":"~"},{"$f":"Aanwezig!E4","v":"~"},{"$f":"Aanwezig!F4","v":"~"},{"$f":"Aanwezig!G4","v":"~"},{"$f":"Aanwezig!H4","v":"~"},{"$f":"Aanwezig!I4","v":"~"},{"$f":"Aanwezig!J4","v":"~"},{"$f":"Aanwezig!K4","v":"~"},{"$f":"Aanwezig!L4","v":"~"},{"$f":"Aanwezig!M4","v":"~"},{"$f":"Aanwezig!N4","v":"~"},{"$f":"Aanwezig!O4","v":"~"},{"$f":"Aanwezig!P4","v":"~"},{"$f":"Aanwezig!Q4","v":"~"},{"$f":"Aanwezig!R4","v":"~"},{"$f":"Aanwezig!S4","v":"~"},{"$f":"Aanwezig!T4","v":"~"},{"$f":"Aanwezig!U4","v":"~"},{"$f":"Aanwezig!V4","v":"~"},{"$f":"Aanwezig!W4","v":"~"},{"$f":"Aanwezig!X4","v":"~"},{"$f":"Aanwezig!Y4","v":"~"},{"$f":"Aanwezig!Z4","v":"~"},{"$f":"Aanwezig!AA4","v":"~"},{"$f":"Aanwezig!AB4","v":"~"},{"$f":"Aanwezig!AC4","v":"~"}]
[null,{"$f":"IF(Kalender!$H$5=\"\",\"\",Kalender!$H$5)","v":5},{"$f":"IF(Kalender!$H$6=\"\",\"\",Kalender!$H$6)","v":2},{"$f":"IF(Kalender!$H$7=\"\",\"\",Kalender!$H$7)","v":""},{"$f":"IF(Kalender!$H$9=\"\",\"\",Kalender!$H$9)","v":""},{"$f":"IF(Kalender!$H$10=\"\",\"\",Kalender!$H$10)","v":"Uitgesteld"},{"$f":"IF(Kalender!$H$11=\"\",\"\",Kalender!$H$11)","v":""},{"$f":"IF(Kalender!$H$12=\"\",\"\",Kalender!$H$12)","v":""},{"$f":"IF(Kalender!$H$13=\"\",\"\",Kalender!$H$13)","v":""},{"$f":"IF(Kalender!$H$14=\"\",\"\",Kalender!$H$14)","v":""},{"$f":"IF(Kalender!$H$15=\"\",\"\",Kalender!$H$15)","v":""},{"$f":"IF(Kalender!$H$16=\"\",\"\",Kalender!$H$16)","v":""},{"$f":"IF(Kalender!$H$17=\"\",\"\",Kalender!$H$17)","v":""},{"$f":"IF(Kalender!$H$18=\"\",\"\",Kalender!$H$18)","v":"Uitgesteld"},{"$f":"IF(Kalender!$H$36=\"\",\"\",Kalender!$H$36)","v":""},{"$f":"IF(Kalender!$H$38=\"\",\"\",Kalender!$H$38)","v":""},{"$f":"IF(Kalender!$H$25=\"\",\"\",Kalender!$H$25)","v":""},{"$f":"IF(Kalender!$H$28=\"\",\"\",Kalender!$H$28)","v":""},{"$f":"IF(Kalender!$H$29=\"\",\"\",Kalender!$H$29)","v":""},{"$f":"IF(Kalender!$H$31=\"\",\"\",Kalender!$H$31)","v":""},{"$f":"IF(Kalender!$H$32=\"\",\"\",Kalender!$H$32)","v":""},{"$f":"IF(Kalender!$H$33=\"\",\"\",Kalender!$H$33)","v":""},{"$f":"IF(Kalender!$H$34=\"\",\"\",Kalender!$H$34)","v":""},{"$f":"IF(Kalender!$H$36=\"\",\"\",Kalender!$H$36)","v":""},{"$f":"IF(Kalender!$H$34=\"\",\"\",Kalender!$H$34)","v":""},null,null,null,{"$f":"Aanwezig!AC5","v":""}]
[null,{"$f":"Kalender!$E$5","v":"KWB Hombeek"},{"$f":"Kalender!$E$6","v":"KWB Putte"},{"$f":"Kalender!$E$7","v":"KWB Hombeek"},{"$f":"Kalender!$E$9","v":"KWB Hombeek"},{"$f":"Kalender!$E$10","v":"VK Wakkerzeel"},{"$f":"Kalender!$E$11","v":"KWB Hombeek"},{"$f":"Kalender!$E$12","v":"Vosberg Sport"},{"$f":"Kalender!$E$13","v":"FC Vilv Heverlee"},{"$f":"Kalender!$E$14","v":"KWB Hombeek"},{"$f":"Kalender!$E$15","v":"FC Blaasveld"},{"$f":"Kalender!$E$16","v":"KWB Hombeek"},{"$f":"Kalender!$E$17","v":"KWB Hombeek"},{"$f":"Kalender!$E$18","v":"Ludwina Bonheiden"},{"$f":"Kalender!$E$23","v":"VFL Malines"},{"$f":"Kalender!$E$24","v":"KWB Hombeek"},{"$f":"Kalender!$E$25","v":"Boerenb. Broechem"},{"$f":"Kalender!$E$28","v":"KWB Hombeek"},{"$f":"Kalender!$E$29","v":"VK Albatros"},{"$f":"Kalender!$E$31","v":"KWB Hombeek"},{"$f":"Kalender!$E$32","v":"Jamaswapi"},{"$f":"Kalender!$E$33","v":"KWB Hombeek"},{"$f":"Kalender!$E$34","v":"Plenke Werchter"},{"$f":"Kalender!$E$36","v":"KWB Hombeek"}]
[null,{"$f":"Kalender!$A$5","v":"2017-09-03"},{"$f":"Kalender!$A$6","v":"2017-09-10"},{"$f":"Kalender!$A$7","v":"2017-09-17"},{"$f":"Kalender!$A$9","v":"2017-10-01"},{"$f":"Kalender!$A$10","v":"2017-10-08"},{"$f":"Kalender!$A$11","v":"2017-10-15"},{"$f":"Kalender!$A$12","v":"2017-10-22"},{"$f":"Kalender!$A$13","v":"2017-10-29"},{"$f":"Kalender!$A$14","v":"2017-11-05"},{"$f":"Kalender!$A$15","v":"2017-11-12"},{"$f":"Kalender!$A$16","v":"2017-11-19"},{"$f":"Kalender!$A$17","v":"2017-11-26"},{"$f":"Kalender!$A$18","v":"2017-12-03"},{"$f":"Kalender!$A$23","v":"2018-01-07"},{"$f":"Kalender!$A$24","v":"2018-01-14"},{"$f":"Kalender!$A$25","v":"2018-01-21"},{"$f":"Kalender!$A$28","v":"2018-02-11"},{"$f":"Kalender!$A$29","v":"2018-02-18"},{"$f":"Kalender!$A$31","v":"2018-03-04"},{"$f":"Kalender!$A$32","v":"2018-03-11"},{"$f":"Kalender!$A$33","v":"2018-03-18"},{"$f":"Kalender!$A$34","v":"2018-03-25"},{"$f":"Kalender!$A$36","v":"2018-04-08"}]
["Addo Brian",null,null,null,null,null,null,null,null,null,null,null,null,null,null,null,null,null,null,null,null,null,null,null,null,null,null,null,null,null,{"$f":"SUM(B8:AC8)","v":0}]
["Beeckmans Sander",null,null,null,null,null,null,null,null,null,null,null,null,null,null,null,null,null,null,null,null,null,null,null,null,null,null,null,null,null,0]
["Beeckmans Thomas",null,null,null,null,null,null,null,null,null,null,null,null,null,null,null,null,null,null,null,null,null,null,null,null,null,null,null,null,null,0]
["Begine Bob",null,null,null,null,null,null,null,null,null,null,null,null,null,null,null,null,null,null,null,null,null,null,null,null,null,null,null,null,null,0]
["Cortebeeck Glenn",null,null,null,null,null,null,null,null,null,null,null,null,null,null,null,null,null,null,null,null,null,null,null,null,null,null,null,null,null,0]
["De Buyser Gert",null,null,null,null,null,null,null,null,null,null,null,null,null,null,null,null,null,null,null,null,null,null,null,null,null,null,null,null,null,0]
["De Cock Michael",null,2,null,null,null,null,null,null,null,null,null,null,null,null,null,null,null,null,null,null,null,null,null,null,null,null,null,null,null,2]
["De Haes Wim",null,null,null,null,null,null,null,null,null,null,null,null,null,null,null,null,null,null,null,null,null,null,null,null,null,null,null,null,null,0]
["El Azzouzi Ahmed",null,null,null,null,null,null,null,null,null,null,null,null,null,null,null,null,null,null,null,null,null,null,null,null,null,null,null,null,null,0]
["Gijsen Angelo",null,null,null,null,null,null,null,null,null,null,null,null,null,null,null,null,null,null,null,null,null,null,null,null,null,null,null,null,null,{"$f":"SUM(B17:AC17)","v":0}]
["Goossens Stijn",null,null,null,null,null,null,null,null,null,null,null,null,null,null,null,null,null,null,null,null,null,null,null,null,null,null,null,null,null,0]
["Goovaerts Hans",null,null,null,null,null,null,null,null,null,null,null,null,null,null,null,null,null,null,null,null,null,null,null,null,null,null,null,null,null,0]
["Jarray Imed",null,null,null,null,null,null,null,null,null,null,null,null,null,null,null,null,null,null,null,null,null,null,null,null,null,null,null,null,null,0]
["Mayembi Yves",null,null,null,null,null,null,null,null,null,null,null,null,null,null,null,null,null,null,null,null,null,null,null,null,null,null,null,null,null,0]
["Noppen Jochem",null,null,null,null,null,null,null,null,null,null,null,null,null,null,null,null,null,null,null,null,null,null,null,null,null,null,null,null,null,0]
["Pollenus Youri",null,null,null,null,null,null,null,null,null,null,null,null,null,null,null,null,null,null,null,null,null,null,null,null,null,null,null,null,null,0]
["Reyniers Peter",null,null,null,null,null,null,null,null,null,null,null,null,null,null,null,null,null,null,null,null,null,null,null,null,null,null,null,null,null,0]
["Roosen Mark",null,null,null,null,null,null,null,null,null,null,null,null,null,null,null,null,null,null,null,null,null,null,null,null,null,null,null,null,null,0]
["Soli Peter",null,null,null,null,null,null,null,null,null,null,null,null,null,null,null,null,null,null,null,null,null,null,null,null,null,null,null,null,null,0]
["Steens Alexander",null,null,null,null,null,null,null,null,null,null,null,null,null,null,null,null,null,null,null,null,null,null,null,null,null,null,null,null,null,0]
["Tariku Habel",null,1,null,null,null,null,null,null,null,null,null,null,null,null,null,null,null,null,null,null,null,null,null,null,null,null,null,null,null,1]
["Teck Jan",null,null,null,null,null,null,null,null,null,null,null,null,null,null,null,null,null,null,null,null,null,null,null,null,null,null,null,null,null,0]
["Troch Wesley",null,null,null,null,null,null,null,null,null,null,null,null,null,null,null,null,null,null,null,null,null,null,null,null,null,null,null,null,null,0]
["Van Winghe Niels",null,null,null,null,null,null,null,null,null,null,null,null,null,null,null,null,null,null,null,null,null,null,null,null,null,null,null,null,null,0]
["Vanmeerbeeck Jonas",null,null,null,null,null,null,null,null,null,null,null,null,null,null,null,null,null,null,null,null,null,null,null,null,null,null,null,null,null,0]
["Vercammen Bart",null,null,null,null,null,null,null,null,null,null,null,null,null,null,null,null,null,null,null,null,null,null,null,null,null,null,null,null,null,0]
["Vermeeren Kevin",null,null,null,null,null,null,null,null,null,null,null,null,null,null,null,null,null,null,null,null,null,null,null,null,null,null,null,null,null,0]
["Vlaeminck Dimitri",null,1,null,null,null,null,null,null,null,null,null,null,null,null,null,null,null,null,null,null,null,null,null,null,null,null,null,null,null,1]
["Wellens Nico",null,null,null,null,null,null,null,null,null,null,null,null,null,null,null,null,null,null,null,null,null,null,null,null,null,null,null,null,null,0]
["Windelen Robbie",null,null,null,null,null,null,null,null,null,null,null,null,null,null,null,null,null,null,null,null,null,null,null,null,null,null,null,null,null,0]
["Wouters Kristof",1,null,null,null,null,null,null,null,null,null,null,null,null,null,null,null,null,null,null,null,null,null,null,null,null,null,null,null,null,1]
[]
["Totaal assists",{"$f":"SUM(B8:B38)","v":1},4,0,0,0,0,0,0,0,0,0,0,0,0,0,0,0,0,0,0,0,0,0,0,0,0,0,0]

{"sheet":"Statistieken","index":4,"n_rows":41,"n_cols":21,"rows_kept":41,"cut":false,"hidden":false,"merged":[[46,5,46,11],[46,13,46,19],[47,5,47,11],[47,13,47,20],[1,5,6,5],[1,6,6,6],[1,7,6,7],[1,11,6,11],[45,13,45,19],[45,5,45,11],[1,19,6,19],[1,20,6,20],[0,0,0,21],[1,1,6,1],[1,2,6,2],[1,3,6,3],[1,4,6,4],[1,8,6,8],[1,9,6,9],[1,10,6,10],[1,12,6,12],[1,14,6,14],[1,13,6,13],[1,15,6,15],[1,21,6,21],[1,16,6,16],[1,17,6,17],[1,18,6,18]]}
["Statistieken seizoen 2017-2018"]
[null,"Aanwezig","Totaal wedstrijden","% aanwezig","Wedstrijden in minuten","Gespeeld in minuten","% gespeeld in minuten","Volledige wedstrijd","Ingevallen","Gewisseld","Aanwezig niet gespeeld","Afwezig verwittigd","Afwezig niet verwittigd","Afwezig wegens blessure","Schorsing geel/rood","Goals","Assists","Goals per gespeelde minuut","Assists per gespeelde minuut","Gemiddeld aantal goals per wedstrijd","Gemiddeld aantal assists per wedstrijd"]
[]
[]
[]
[]
[]
["Addo Brian",{"$f":"SUM(H8:K8)","v":0},{"$f":"Aanwezig!AN8","v":2},{"$f":"SUM(B8/C8)","v":0},{"$f":"SUM(H8:J8)*90","v":0},{"$f":"SUM((H8*90)+SUM(I8:J8)*45)","v":0},{"$f":"IF(E8=0,0,SUM(F8/E8))","v":0},{"$f":"Aanwezig!AE8","v":0},{"$f":"Aanwezig!AF8","v":0},{"$f":"Aanwezig!AG8","v":0},{"$f":"(Aanwezig!AH8)+(Aanwezig!AM8)","v":0},{"$f":"Aanwezig!AI8","v":0},{"$f":"Aanwezig!AJ8","v":2},{"$f":"Aanwezig!AK8","v":0},{"$f":"Aanwezig!AL8","v":0},{"$f":"Goals!AE8","v":0},{"$f":"Assists!AE8","v":0},{"$f":"IF((P8=0),\"0\",SUM(F8/P8))","v":"0"},{"$f":"IF((Q8=0),\"0\",SUM(F8/Q8))","v":"0"},{"$f":"IF((B8=0),\"0,00\",SUM(P8/B8))","v":"0,00"},{"$f":"IF((B8=0),\"0,00\",SUM(Q8/B8))","v":"0,00"}]
["Beeckmans Sander",{"$f":"SUM(H9:K9)","v":0},{"$f":"Aanwezig!AN9","v":0},{"$f":"SUM(B9/C9)","v":{"$error":"#DIV/0!"}},{"$f":"SUM(H9:J9)*90","v":0},{"$f":"SUM((H9*90)+SUM(I9:J9)*45)","v":0},{"$f":"IF(E9=0,0,SUM(F9/E9))","v":0},{"$f":"Aanwezig!AE9","v":0},{"$f":"Aanwezig!AF9","v":0},{"$f":"Aanwezig!AG9","v":0},{"$f":"(Aanwezig!AH9)+(Aanwezig!AM9)","v":0},{"$f":"Aanwezig!AI9","v":0},{"$f":"Aanwezig!AJ9","v":0},{"$f":"Aanwezig!AK9","v":2},{"$f":"Aanwezig!AL9","v":0},{"$f":"Goals!AE9","v":0},{"$f":"Assists!AE9","v":0},{"$f":"IF((P9=0),\"0\",SUM(F9/P9))","v":"0"},{"$f":"IF((Q9=0),\"0\",SUM(F9/Q9))","v":"0"},"0,00","0,00"]
["Beeckmans Thomas",2,{"$f":"Aanwezig!AN10","v":2},1,180,180,1,{"$f":"Aanwezig!AE10","v":2},{"$f":"Aanwezig!AF10","v":0},{"$f":"Aanwezig!AG10","v":0},{"$f":"(Aanwezig!AH10)+(Aanwezig!AM10)","v":0},{"$f":"Aanwezig!AI10","v":0},{"$f":"Aanwezig!AJ10","v":0},{"$f":"Aanwezig!AK10","v":0},{"$f":"Aanwezig!AL10","v":0},{"$f":"Goals!AE10","v":0},{"$f":"Assists!AE10","v":0},"0","0",0,0]
["Begine Bob",1,{"$f":"Aanwezig!AN11","v":2},0.5,0,0,0,{"$f":"Aanwezig!AE11","v":0},{"$f":"Aanwezig!AF11","v":0},{"$f":"Aanwezig!AG11","v":0},{"$f":"(Aanwezig!AH11)+(Aanwezig!AM11)","v":1},{"$f":"Aanwezig!AI11","v":0},{"$f":"Aanwezig!AJ11","v":0},{"$f":"Aanwezig!AK11","v":0},{"$f":"Aanwezig!AL11","v":0},{"$f":"Goals!AE11","v":0},{"$f":"Assists!AE11","v":0},"0","0",0,0]
["Cortebeeck Glenn",{"$f":"SUM(H12:K12)","v":2},{"$f":"Aanwezig!AN12","v":2},{"$f":"SUM(B12/C12)","v":1},180,180,{"$f":"IF(E12=0,0,SUM(F12/E12))","v":1},{"$f":"Aanwezig!AE12","v":2},{"$f":"Aanwezig!AF12","v":0},{"$f":"Aanwezig!AG12","v":0},{"$f":"(Aanwezig!AH12)+(Aanwezig!AM12)","v":0},{"$f":"Aanwezig!AI12","v":0},{"$f":"Aanwezig!AJ12","v":0},{"$f":"Aanwezig!AK12","v":0},{"$f":"Aanwezig!AL12","v":0},{"$f":"Goals!AE12","v":0},{"$f":"Assists!AE12","v":0},{"$f":"IF((P12=0),\"0\",SUM(F12/P12))","v":"0"},{"$f":"IF((Q12=0),\"0\",SUM(F12/Q12))","v":"0"},{"$f":"IF((B12=0),\"0,00\",SUM(P12/B12))","v":0},{"$f":"IF((B12=0),\"0,00\",SUM(Q12/B12))","v":0}]
["De Buyser Gert",2,{"$f":"Aanwezig!AN13","v":2},1,180,135,0.75,{"$f":"Aanwezig!AE13","v":1},{"$f":"Aanwezig!AF13","v":0},{"$f":"Aanwezig!AG13","v":1},{"$f":"(Aanwezig!AH13)+(Aanwezig!AM13)","v":0},{"$f":"Aanwezig!AI13","v":0},{"$f":"Aanwezig!AJ13","v":0},{"$f":"Aanwezig!AK13","v":0},{"$f":"Aanwezig!AL13","v":0},{"$f":"Goals!AE13","v":0},{"$f":"Assists!AE13","v":0},"0","0",0,0]
["De Cock Michael",2,{"$f":"Aanwezig!AN14","v":2},1,180,135,0.75,{"$f":"Aanwezig!AE14","v":1},{"$f":"Aanwezig!AF14","v":0},{"$f":"Aanwezig!AG14","v":1},{"$f":"(Aanwezig!AH14)+(Aanwezig!AM14)","v":0},{"$f":"Aanwezig!AI14","v":0},{"$f":"Aanwezig!AJ14","v":0},{"$f":"Aanwezig!AK14","v":0},{"$f":"Aanwezig!AL14","v":0},{"$f":"Goals!AE14","v":2},{"$f":"Assists!AE14","v":2},67.5,67.5,{"$f":"IF((B14=0),\"0,00\",SUM(P14/B14))","v":1},{"$f":"IF((B14=0),\"0,00\",SUM(Q14/B14))","v":1}]
["De Haes Wim",0,{"$f":"Aanwezig!AN15","v":2},0,0,0,0,{"$f":"Aanwezig!AE15","v":0},{"$f":"Aanwezig!AF15","v":0},{"$f":"Aanwezig!AG15","v":0},{"$f":"(Aanwezig!AH15)+(Aanwezig!AM15)","v":0},{"$f":"Aanwezig!AI15","v":23},{"$f":"Aanwezig!AJ15","v":0},{"$f":"Aanwezig!AK15","v":0},{"$f":"Aanwezig!AL15","v":0},{"$f":"Goals!AE15","v":0},{"$f":"Assists!AE15","v":0},"0","0",{"$f":"IF((B15=0),\"0,00\",SUM(P15/B15))","v":"0,00"},{"$f":"IF((B15=0),\"0,00\",SUM(Q15/B15))","v":"0,00"}]
["El Azzouzi Ahmed",{"$f":"SUM(H16:K16)","v":2},{"$f":"Aanwezig!AN16","v":2},{"$f":"SUM(B16/C16)","v":1},180,135,{"$f":"IF(E16=0,0,SUM(F16/E16))","v":0.75},{"$f":"Aanwezig!AE16","v":1},{"$f":"Aanwezig!AF16","v":0},{"$f":"Aanwezig!AG16","v":1},{"$f":"(Aanwezig!AH16)+(Aanwezig!AM16)","v":0},{"$f":"Aanwezig!AI16","v":0},{"$f":"Aanwezig!AJ16","v":0},{"$f":"Aanwezig!AK16","v":0},{"$f":"Aanwezig!AL16","v":0},{"$f":"Goals!AE16","v":0},{"$f":"Assists!AE16","v":0},{"$f":"IF((P16=0),\"0\",SUM(F16/P16))","v":"0"},{"$f":"IF((Q16=0),\"0\",SUM(F16/Q16))","v":"0"},{"$f":"IF((B16=0),\"0,00\",SUM(P16/B16))","v":0},{"$f":"IF((B16=0),\"0,00\",SUM(Q16/B16))","v":0}]
["Gijsen Angelo",{"$f":"SUM(H17:K17)","v":0},{"$f":"Aanwezig!AN17","v":0},{"$f":"SUM(B17/C17)","v":{"$error":"#DIV/0!"}},0,0,{"$f":"IF(E17=0,0,SUM(F17/E17))","v":0},{"$f":"Aanwezig!AE17","v":0},{"$f":"Aanwezig!AF17","v":0},{"$f":"Aanwezig!AG17","v":0},{"$f":"(Aanwezig!AH17)+(Aanwezig!AM17)","v":0},{"$f":"Aanwezig!AI17","v":0},{"$f":"Aanwezig!AJ17","v":0},{"$f":"Aanwezig!AK17","v":2},{"$f":"Aanwezig!AL17","v":0},{"$f":"Goals!AE17","v":0},{"$f":"Assists!AE17","v":0},{"$f":"IF((P17=0),\"0\",SUM(F17/P17))","v":"0"},{"$f":"IF((Q17=0),\"0\",SUM(F17/Q17))","v":"0"},{"$f":"IF((B17=0),\"0,00\",SUM(P17/B17))","v":"0,00"},{"$f":"IF((B17=0),\"0,00\",SUM(Q17/B17))","v":"0,00"}]
["Goossens Stijn",{"$f":"SUM(H18:K18)","v":0},{"$f":"Aanwezig!AN18","v":2},{"$f":"SUM(B18/C18)","v":0},0,0,{"$f":"IF(E18=0,0,SUM(F18/E18))","v":0},{"$f":"Aanwezig!AE18","v":0},{"$f":"Aanwezig!AF18","v":0},{"$f":"Aanwezig!AG18","v":0},{"$f":"(Aanwezig!AH18)+(Aanwezig!AM18)","v":0},{"$f":"Aanwezig!AI18","v":23},{"$f":"Aanwezig!AJ18","v":0},{"$f":"Aanwezig!AK18","v":0},{"$f":"Aanwezig!AL18","v":0},{"$f":"Goals!AE18","v":0},{"$f":"Assists!AE18","v":0},{"$f":"IF((P18=0),\"0\",SUM(F18/P18))","v":"0"},{"$f":"IF((Q18=0),\"0\",SUM(F18/Q18))","v":"0"},{"$f":"IF((B18=0),\"0,00\",SUM(P18/B18))","v":"0,00"},{"$f":"IF((B18=0),\"0,00\",SUM(Q18/B18))","v":"0,00"}]
["Goovaerts Hans",0,{"$f":"Aanwezig!AN19","v":2},0,0,0,0,{"$f":"Aanwezig!AE19","v":0},{"$f":"Aanwezig!AF19","v":0},{"$f":"Aanwezig!AG19","v":0},{"$f":"(Aanwezig!AH19)+(Aanwezig!AM19)","v":0},{"$f":"Aanwezig!AI19","v":23},{"$f":"Aanwezig!AJ19","v":0},{"$f":"Aanwezig!AK19","v":0},{"$f":"Aanwezig!AL19","v":0},{"$f":"Goals!AE19","v":0},{"$f":"Assists!AE19","v":0},"0","0","0,00","0,00"]
["Jarray Imed",0,{"$f":"Aanwezig!AN20","v":2},0,0,0,0,{"$f":"Aanwezig!AE20","v":0},{"$f":"Aanwezig!AF20","v":0},{"$f":"Aanwezig!AG20","v":0},{"$f":"(Aanwezig!AH20)+(Aanwezig!AM20)","v":0},{"$f":"Aanwezig!AI20","v":2},{"$f":"Aanwezig!AJ20","v":0},{"$f":"Aanwezig!AK20","v":0},{"$f":"Aanwezig!AL20","v":0},{"$f":"Goals!AE20","v":0},{"$f":"Assists!AE20","v":0},"0","0","0,00","0,00"]
["Mayembi Yves",{"$f":"SUM(H21:K21)","v":2},{"$f":"Aanwezig!AN21","v":2},{"$f":"SUM(B21/C21)","v":1},{"$f":"SUM(H21:J21)*90","v":180},{"$f":"SUM((H21*90)+SUM(I21:J21)*45)","v":135},{"$f":"IF(E21=0,0,SUM(F21/E21))","v":0.75},{"$f":"Aanwezig!AE21","v":1},{"$f":"Aanwezig!AF21","v":0},{"$f":"Aanwezig!AG21","v":1},{"$f":"(Aanwezig!AH21)+(Aanwezig!AM21)","v":0},{"$f":"Aanwezig!AI21","v":0},{"$f":"Aanwezig!AJ21","v":0},{"$f":"Aanwezig!AK21","v":0},{"$f":"Aanwezig!AL21","v":0},{"$f":"Goals!AE21","v":0},{"$f":"Assists!AE21","v":0},{"$f":"IF((P21=0),\"0\",SUM(F21/P21))","v":"0"},{"$f":"IF((Q21=0),\"0\",SUM(F21/Q21))","v":"0"},{"$f":"IF((B21=0),\"0,00\",SUM(P21/B21))","v":0},{"$f":"IF((B21=0),\"0,00\",SUM(Q21/B21))","v":0}]
["Noppen Jochem",{"$f":"SUM(H22:K22)","v":2},{"$f":"Aanwezig!AN22","v":2},{"$f":"SUM(B22/C22)","v":1},90,45,{"$f":"IF(E22=0,0,SUM(F22/E22))","v":0.5},{"$f":"Aanwezig!AE22","v":0},{"$f":"Aanwezig!AF22","v":1},{"$f":"Aanwezig!AG22","v":0},{"$f":"(Aanwezig!AH22)+(Aanwezig!AM22)","v":1},{"$f":"Aanwezig!AI22","v":0},{"$f":"Aanwezig!AJ22","v":0},{"$f":"Aanwezig!AK22","v":0},{"$f":"Aanwezig!AL22","v":0},{"$f":"Goals!AE22","v":0},{"$f":"Assists!AE22","v":0},{"$f":"IF((P22=0),\"0\",SUM(F22/P22))","v":"0"},{"$f":"IF((Q22=0),\"0\",SUM(F22/Q22))","v":"0"},{"$f":"IF((B22=0),\"0,00\",SUM(P22/B22))","v":0},{"$f":"IF((B22=0),\"0,00\",SUM(Q22/B22))","v":0}]
["Pollenus Youri",{"$f":"SUM(H23:K23)","v":2},{"$f":"Aanwezig!AN23","v":2},{"$f":"SUM(B23/C23)","v":1},{"$f":"SUM(H23:J23)*90","v":180},{"$f":"SUM((H23*90)+SUM(I23:J23)*45)","v":135},{"$f":"IF(E23=0,0,SUM(F23/E23))","v":0.75},{"$f":"Aanwezig!AE23","v":1},{"$f":"Aanwezig!AF23","v":0},{"$f":"Aanwezig!AG23","v":1},{"$f":"(Aanwezig!AH23)+(Aanwezig!AM23)","v":0},{"$f":"Aanwezig!AI23","v":0},{"$f":"Aanwezig!AJ23","v":0},{"$f":"Aanwezig!AK23","v":0},{"$f":"Aanwezig!AL23","v":0},{"$f":"Goals!AE23","v":0},{"$f":"Assists!AE23","v":0},{"$f":"IF((P23=0),\"0\",SUM(F23/P23))","v":"0"},{"$f":"IF((Q23=0),\"0\",SUM(F23/Q23))","v":"0"},{"$f":"IF((B23=0),\"0,00\",SUM(P23/B23))","v":0},{"$f":"IF((B23=0),\"0,00\",SUM(Q23/B23))","v":0}]
["Reyniers Peter",0,{"$f":"Aanwezig!AN24","v":2},0,0,0,0,{"$f":"Aanwezig!AE24","v":0},{"$f":"Aanwezig!AF24","v":0},{"$f":"Aanwezig!AG24","v":0},{"$f":"(Aanwezig!AH24)+(Aanwezig!AM24)","v":0},{"$f":"Aanwezig!AI24","v":23},{"$f":"Aanwezig!AJ24","v":0},{"$f":"Aanwezig!AK24","v":0},{"$f":"Aanwezig!AL24","v":0},{"$f":"Goals!AE24","v":0},{"$f":"Assists!AE24","v":0},"0","0","0,00","0,00"]
["Roosen Mark",0,{"$f":"Aanwezig!AN25","v":-21},0,0,0,0,{"$f":"Aanwezig!AE25","v":0},{"$f":"Aanwezig!AF25","v":0},{"$f":"Aanwezig!AG25","v":0},{"$f":"(Aanwezig!AH25)+(Aanwezig!AM25)","v":0},{"$f":"Aanwezig!AI25","v":0},{"$f":"Aanwezig!AJ25","v":0},{"$f":"Aanwezig!AK25","v":23},{"$f":"Aanwezig!AL25","v":0},{"$f":"Goals!AE25","v":0},{"$f":"Assists!AE25","v":0},"0","0","0,00","0,00"]
["Soli Peter",1,{"$f":"Aanwezig!AN26","v":2},0.5,90,90,1,{"$f":"Aanwezig!AE26","v":1},{"$f":"Aanwezig!AF26","v":0},{"$f":"Aanwezig!AG26","v":0},{"$f":"(Aanwezig!AH26)+(Aanwezig!AM26)","v":0},{"$f":"Aanwezig!AI26","v":1},{"$f":"Aanwezig!AJ26","v":0},{"$f":"Aanwezig!AK26","v":0},{"$f":"Aanwezig!AL26","v":0},{"$f":"Goals!AE26","v":1},{"$f":"Assists!AE26","v":0},90,"0",1,0]
["Steens Alexander",0,{"$f":"Aanwezig!AN27","v":2},0,0,0,0,{"$f":"Aanwezig!AE27","v":0},{"$f":"Aanwezig!AF27","v":0},{"$f":"Aanwezig!AG27","v":0},{"$f":"(Aanwezig!AH27)+(Aanwezig!AM27)","v":0},{"$f":"Aanwezig!AI27","v":23},{"$f":"Aanwezig!AJ27","v":0},{"$f":"Aanwezig!AK27","v":0},{"$f":"Aanwezig!AL27","v":0},{"$f":"Goals!AE27","v":0},{"$f":"Assists!AE27","v":0},"0","0","0,00","0,00"]
["Tariku Habel",{"$f":"SUM(H28:K28)","v":1},{"$f":"Aanwezig!AN28","v":2},{"$f":"SUM(B28/C28)","v":0.5},90,45,{"$f":"IF(E28=0,0,SUM(F28/E28))","v":0.5},{"$f":"Aanwezig!AE28","v":0},{"$f":"Aanwezig!AF28","v":1},{"$f":"Aanwezig!AG28","v":0},{"$f":"(Aanwezig!AH28)+(Aanwezig!AM28)","v":0},{"$f":"Aanwezig!AI28","v":1},{"$f":"Aanwezig!AJ28","v":0},{"$f":"Aanwezig!AK28","v":0},{"$f":"Aanwezig!AL28","v":0},{"$f":"Goals!AE28","v":0},{"$f":"Assists!AE28","v":1},{"$f":"IF((P28=0),\"0\",SUM(F28/P28))","v":"0"},{"$f":"IF((Q28=0),\"0\",SUM(F28/Q28))","v":45},{"$f":"IF((B28=0),\"0,00\",SUM(P28/B28))","v":0},{"$f":"IF((B28=0),\"0,00\",SUM(Q28/B28))","v":1}]
["Teck Jan",2,{"$f":"Aanwezig!AN29","v":2},1,180,135,0.75,{"$f":"Aanwezig!AE29","v":1},{"$f":"Aanwezig!AF29","v":1},{"$f":"Aanwezig!AG29","v":0},{"$f":"(Aanwezig!AH29)+(Aanwezig!AM29)","v":0},{"$f":"Aanwezig!AI29","v":0},{"$f":"Aanwezig!AJ29","v":0},{"$f":"Aanwezig!AK29","v":0},{"$f":"Aanwezig!AL29","v":0},{"$f":"Goals!AE29","v":0},{"$f":"Assists!AE29","v":0},"0","0",{"$f":"IF((B29=0),\"0,00\",SUM(P29/B29))","v":0},{"$f":"IF((B29=0),\"0,00\",SUM(Q29/B29))","v":0}]
["Troch Wesley",2,{"$f":"Aanwezig!AN30","v":2},1,180,180,1,{"$f":"Aanwezig!AE30","v":2},{"$f":"Aanwezig!AF30","v":0},{"$f":"Aanwezig!AG30","v":0},{"$f":"(Aanwezig!AH30)+(Aanwezig!AM30)","v":0},{"$f":"Aanwezig!AI30","v":0},{"$f":"Aanwezig!AJ30","v":0},{"$f":"Aanwezig!AK30","v":0},{"$f":"Aanwezig!AL30","v":0},{"$f":"Goals!AE30","v":2},{"$f":"Assists!AE30","v":0},90,"0",1,0]
["Van Winghe Niels",0,{"$f":"Aanwezig!AN31","v":2},0,0,0,0,{"$f":"Aanwezig!AE31","v":0},{"$f":"Aanwezig!AF31","v":0},{"$f":"Aanwezig!AG31","v":0},{"$f":"(Aanwezig!AH31)+(Aanwezig!AM31)","v":0},{"$f":"Aanwezig!AI31","v":0},{"$f":"Aanwezig!AJ31","v":2},{"$f":"Aanwezig!AK31","v":0},{"$f":"Aanwezig!AL31","v":0},{"$f":"Goals!AE31","v":0},{"$f":"Assists!AE31","v":0},"0","0","0,00","0,00"]
["Vanmeerbeeck Jonas",2,{"$f":"Aanwezig!AN32","v":2},1,90,45,0.5,{"$f":"Aanwezig!AE32","v":0},{"$f":"Aanwezig!AF32","v":1},{"$f":"Aanwezig!AG32","v":0},{"$f":"(Aanwezig!AH32)+(Aanwezig!AM32)","v":1},{"$f":"Aanwezig!AI32","v":0},{"$f":"Aanwezig!AJ32","v":0},{"$f":"Aanwezig!AK32","v":0},{"$f":"Aanwezig!AL32","v":0},{"$f":"Goals!AE32","v":0},{"$f":"Assists!AE32","v":0},"0","0",0,0]
["Vercammen Bart",{"$f":"SUM(H33:K33)","v":2},{"$f":"Aanwezig!AN33","v":2},{"$f":"SUM(B33/C33)","v":1},0,0,{"$f":"IF(E33=0,0,SUM(F33/E33))","v":0},{"$f":"Aanwezig!AE33","v":0},{"$f":"Aanwezig!AF33","v":0},{"$f":"Aanwezig!AG33","v":0},{"$f":"(Aanwezig!AH33)+(Aanwezig!AM33)","v":2},{"$f":"Aanwezig!AI33","v":0},{"$f":"Aanwezig!AJ33","v":0},{"$f":"Aanwezig!AK33","v":0},{"$f":"Aanwezig!AL33","v":0},{"$f":"Goals!AE33","v":0},{"$f":"Assists!AE33","v":0},{"$f":"IF((P33=0),\"0\",SUM(F33/P33))","v":"0"},{"$f":"IF((Q33=0),\"0\",SUM(F33/Q33))","v":"0"},{"$f":"IF((B33=0),\"0,00\",SUM(P33/B33))","v":0},{"$f":"IF((B33=0),\"0,00\",SUM(Q33/B33))","v":0}]
["Vermeeren Kevin",{"$f":"SUM(H34:K34)","v":2},{"$f":"Aanwezig!AN34","v":2},{"$f":"SUM(B34/C34)","v":1},180,180,{"$f":"IF(E34=0,0,SUM(F34/E34))","v":1},{"$f":"Aanwezig!AE34","v":2},{"$f":"Aanwezig!AF34","v":0},{"$f":"Aanwezig!AG34","v":0},{"$f":"(Aanwezig!AH34)+(Aanwezig!AM34)","v":0},{"$f":"Aanwezig!AI34","v":0},{"$f":"Aanwezig!AJ34","v":0},{"$f":"Aanwezig!AK34","v":0},{"$f":"Aanwezig!AL34","v":0},{"$f":"Goals!AE34","v":0},{"$f":"Assists!AE34","v":0},{"$f":"IF((P34=0),\"0\",SUM(F34/P34))","v":"0"},{"$f":"IF((Q34=0),\"0\",SUM(F34/Q34))","v":"0"},{"$f":"IF((B34=0),\"0,00\",SUM(P34/B34))","v":0},{"$f":"IF((B34=0),\"0,00\",SUM(Q34/B34))","v":0}]
["Vlaeminck Dimitri",{"$f":"SUM(H35:K35)","v":1},{"$f":"Aanwezig!AN35","v":1},{"$f":"SUM(B35/C35)","v":1},{"$f":"SUM(H35:J35)*90","v":90},{"$f":"SUM((H35*90)+SUM(I35:J35)*45)","v":45},{"$f":"IF(E35=0,0,SUM(F35/E35))","v":0.5},{"$f":"Aanwezig!AE35","v":0},{"$f":"Aanwezig!AF35","v":1},{"$f":"Aanwezig!AG35","v":0},{"$f":"(Aanwezig!AH35)+(Aanwezig!AM35)","v":0},{"$f":"Aanwezig!AI35","v":0},{"$f":"Aanwezig!AJ35","v":0},{"$f":"Aanwezig!AK35","v":0},{"$f":"Aanwezig!AL35","v":0},{"$f":"Goals!AE35","v":0},{"$f":"Assists!AE35","v":1},{"$f":"IF((P35=0),\"0\",SUM(F35/P35))","v":"0"},{"$f":"IF((Q35=0),\"0\",SUM(F35/Q35))","v":45},{"$f":"IF((B35=0),\"0,00\",SUM(P35/B35))","v":0},{"$f":"IF((B35=0),\"0,00\",SUM(Q35/B35))","v":1}]
["Wellens Nico",0,{"$f":"Aanwezig!AN36","v":2},0,0,0,0,{"$f":"Aanwezig!AE36","v":0},{"$f":"Aanwezig!AF36","v":0},{"$f":"Aanwezig!AG36","v":0},{"$f":"(Aanwezig!AH36)+(Aanwezig!AM36)","v":0},{"$f":"Aanwezig!AI36","v":3},{"$f":"Aanwezig!AJ36","v":1},{"$f":"Aanwezig!AK36","v":0},{"$f":"Aanwezig!AL36","v":0},{"$f":"Goals!AE36","v":0},{"$f":"Assists!AE36","v":0},"0","0","0,00","0,00"]
["Windelen Robbie",0,{"$f":"Aanwezig!AN37","v":2},0,0,0,0,{"$f":"Aanwezig!AE37","v":0},{"$f":"Aanwezig!AF37","v":0},{"$f":"Aanwezig!AG37","v":0},{"$f":"(Aanwezig!AH37)+(Aanwezig!AM37)","v":0},{"$f":"Aanwezig!AI37","v":23},{"$f":"Aanwezig!AJ37","v":0},{"$f":"Aanwezig!AK37","v":0},{"$f":"Aanwezig!AL37","v":0},{"$f":"Goals!AE37","v":0},{"$f":"Assists!AE37","v":0},"0","0","0,00","0,00"]
["Wouters Kristof",2,{"$f":"Aanwezig!AN38","v":2},1,180,180,1,{"$f":"Aanwezig!AE38","v":2},{"$f":"Aanwezig!AF38","v":0},{"$f":"Aanwezig!AG38","v":0},{"$f":"(Aanwezig!AH38)+(Aanwezig!AM38)","v":0},{"$f":"Aanwezig!AI38","v":0},{"$f":"Aanwezig!AJ38","v":0},{"$f":"Aanwezig!AK38","v":0},{"$f":"Aanwezig!AL38","v":0},{"$f":"Goals!AE38","v":1},{"$f":"Assists!AE38","v":1},180,180,0.5,0.5]
[]
["100% aanwezig",null,null,{"$f":"COUNTIF(D8:D38,\"100%\")","v":15}]
["Totaal goals-assists",null,null,null,null,null,null,null,null,null,null,null,null,null,null,{"$f":"SUM(P8:P38)","v":6},{"$f":"SUM(Q8:Q38)","v":5}]

{"sheet":"Wedstrijdblad","index":5,"n_rows":35,"n_cols":21,"rows_kept":35,"cut":false,"hidden":false,"merged":[[33,5,33,7],[27,8,27,10],[27,5,27,7],[32,5,32,7],[32,8,32,10],[28,8,28,10],[29,8,29,10],[30,8,30,10],[31,8,31,10],[28,5,28,7],[29,5,29,7],[30,5,30,7],[31,5,31,7],[34,5,34,7],[35,5,35,7],[27,13,27,15],[27,16,27,18],[28,13,28,15],[29,13,29,15],[28,16,28,18],[29,16,29,18],[34,16,34,18],[30,13,30,15],[31,13,31,15],[32,13,32,15],[33,13,33,15],[33,8,33,10],[34,8,34,10],[35,8,35,10],[0,0,0,2],[35,13,35,15],[35,16,35,18],[26,5,26,7],[26,8,26,10],[26,13,26,15],[26,16,26,18],[2,4,2,10],[2,12,2,18],[0,4,0,9],[0,12,0,17],[34,13,34,15],[30,16,30,18],[31,16,31,18],[32,16,32,18],[33,16,33,18]]}
["Datum",null,null,null,"Ploeg 1",null,null,null,null,null,null,"~","Ploeg 2"]
[]
[null,null,null,null,"1ste helft",null,null,null,null,null,null,null,"2de helft"]
[]
["Brian",null,null,null,null,null,null,null,null,null,null,null,null,null,null,null,null,null,null,null,"Albatros Mechelen"]
["Sakke",null,9,null,null,null,null,null,null,null,null,null,null,null,null,null,null,null,null,null,"Ani Mechelen"]
["Thomas",null,5,null,null,null,null,null,null,null,null,null,null,null,null,null,null,null,null,null,"Astra Begijnendijk"]
["Bob",null," ",null,null,null,null,null,null,null,null,null,null,null,null,null,null,null,null,null,"Boerenbond Broechem"]
["Glenn",null,88,null,null,null,null,null,null,null,null,null,null,null,null,null,null,null,null,null,"FC Blaasveld"]
["Gert",null,3,null,null,null,null,null,null,null,null,null,null,null,null,null,null,null,null,null,"KWB Putte"]
["Michael",null,7,null,null,null,null,null,null,null,null,null,null,null,null,null,null,null,null,null,"KWB voetbal Hombeek"]
["Vos",null,null,null,null,null,null,null,null,null,null,null,null,null,null,null,null,null,null,null,"Plenke Werchter"]
["Saïd",null,null,null,null,null,null,null,null,null,null,null,null,null,null,null,null,null,null,null,"The Sylvesters Mechelen"]
["Angelo",null,10,null,null,null,null,null,null,null,null,null,null,null,null,null,null,null,null,null,"VFL Malines"]
["Stijn",null,null,null,null,null,null,null,null,null,null,null,null,null,null,null,null,null,null,null,"VK Jamaswapi Mechelen"]
["Hans",null,null,null,null,null,null,null,null,null,null,null,null,null,null,null,null,null,null,null,"VK Ludwina Bonheiden"]
["Imed",null,null,null,null,null,null,null,null,null,null,null,null,null,null,null,null,null,null,null,"VK Wakkerzeel"]
["Jerre",null,null,null,null,null,null,null,null,null,null,null,null,null,null,null,null,null,null,null,"Vosberg Sport"]
["Jochem"]
["Youri"]
["Arnie"]
["Mark"]
["Solle"]
["Gipsy"]
["Habel",null," "]
["Teck",null,6]
["Wesley",null,12,null,"Tijd","Uit",null,null,"In",null,null,null,"Tijd","Goal",null,null,"Assist"]
["Winghe",null,2]
["Jonas",null,13]
["Bart"]
["Kevin",null,8]
["Dimitri"]
["Nico",null,1,null,null,"Geel",null,null,"Rood"]
["Robbie"]
["Wally",null,11]

{"sheet":"Mal-T","index":6,"n_rows":34,"n_cols":21,"rows_kept":34,"cut":false,"hidden":false,"merged":[[26,5,26,7],[26,8,26,10],[26,13,26,15],[26,16,26,18],[0,0,0,2],[0,4,0,9],[0,12,0,17],[2,4,2,10],[2,12,2,18],[27,5,27,7],[27,8,27,10],[27,13,27,15],[27,16,27,18],[28,5,28,7],[28,8,28,10],[28,13,28,15],[28,16,28,18],[29,5,29,7],[29,8,29,10],[29,13,29,15],[29,16,29,18],[30,5,30,7],[30,8,30,10],[30,13,30,15],[30,16,30,18],[31,5,31,7],[31,8,31,10],[31,13,31,15],[31,16,31,18],[32,5,32,7],[32,8,32,10],[32,13,32,15],[32,16,32,18],[35,5,35,7],[35,8,35,10],[35,13,35,15],[35,16,35,18],[33,5,33,7],[33,8,33,10],[33,13,33,15],[33,16,33,18],[34,5,34,7],[34,8,34,10],[34,13,34,15],[34,16,34,18]]}
["Datum",null,null,null,"KWB voetbal Hombeek",null,null,null,null,null,5,"~","VFL Malines",null,null,null,null,null,0,"(ff)"]
[]
[null,null,null,null,"1ste helft",null,null,null,null,null,null,null,"2de helft"]
[]
["Brian",null,null,null,null,null,null,null,null,null,null,null,null,null,null,null,null,null,null,null,"Albatros Mechelen"]
["Sakke",null,9,null,null,null,null,null,null,null,null,null,null,null,null,null,null,null,null,null,"Ani Mechelen"]
["Thomas",null,5,null,null,"Wally",null,null,null,"Michael",null,null,null,null,null,null,null,null,null,null,"Astra Begijnendijk"]
["Bob",null," ",null,null,null,null,null,null,null,null,null,null,null,null,null,null,null,null,null,"Boerenbond Broechem"]
["Glenn",null,88,null,null,null,null,null,null,null,null,null,null,null,null,null,null,null,null,null,"FC Blaasveld"]
["Gert",null,3,null,null,null,null,null,null,null,null,null,null,null,null,null,null,null,null,null,"KWB Putte"]
["Michael",null,7,null,null,null,null,null,null,null,null,null,null,null,null,null,null,null,null,null,"KWB voetbal Hombeek"]
["Vos",null,null,null,null,null,null,null,null,null,null,null,null,null,null,null,null,null,null,null,"Plenke Werchter"]
["Saïd",null,null,null,"Jerre",null,"Saïd",null,"Thomas",null,"Wesley",null,null,null,null,null,null,null,null,null,"The Sylvesters Mechelen"]
["Angelo",null,10,null,null,null,null,null,null,null,null,null,null,null,null,null,null,null,null,null,"VFL Malines"]
["Stijn",null,null,null,null,null,null,null,null,null,null,null,null,null,null,null,null,null,null,null,"VK Jamaswapi Mechelen"]
["Hans",null,null,null,null,null,null,null,null,null,null,null,null,null,null,null,null,null,null,null,"VK Ludwina Bonheiden"]
["Imed",null,null,null,null,null,null,"Teck",null,null,null,null,null,null,null,null,null,null,null,null,"VK Wakkerzeel"]
["Jerre",null,null,null,null,null,null,null,null,null,null,null,null,null,null,null,null,null,null,null,"Vosberg Sport"]
["Jochem",null,null,null,null,"Youri",null,null,null,"Kevin"]
["Youri",null,null,null,null,null,null,"Gert"]
["Arnie"]
["Mark"]
["Solle"]
["Gipsy",null,null,null,null,null,null,"Glenn"]
["Habel",null," "]
["Teck",null,6]
["Wesley",null,12,null,"Tijd","Uit",null,null,"In",null,null,null,"Tijd","Goal",null,null,"Assist"]
["Winghe",null,2,null,null,null,null,null,null,null,null,null,"17'","Michael",null,null,"Wally"]
["Jonas",null,13]
["Bart"]
["Kevin",null,8]
["Nico",null,1]
["Robbie",null,null,null,null,"Geel",null,null,"Rood"]
["Wally",null,11]

{"sheet":"Put-U","index":7,"n_rows":35,"n_cols":21,"rows_kept":35,"cut":false,"hidden":false,"merged":[[26,5,26,7],[26,8,26,10],[26,13,26,15],[26,16,26,18],[0,0,0,2],[0,4,0,9],[0,12,0,17],[2,4,2,10],[2,12,2,18],[27,5,27,7],[27,8,27,10],[27,13,27,15],[27,16,27,18],[28,5,28,7],[28,8,28,10],[28,13,28,15],[28,16,28,18],[29,5,29,7],[29,8,29,10],[29,13,29,15],[29,16,29,18],[30,5,30,7],[30,8,30,10],[30,13,30,15],[30,16,30,18],[31,5,31,7],[31,8,31,10],[31,13,31,15],[31,16,31,18],[32,5,32,7],[32,8,32,10],[32,13,32,15],[32,16,32,18],[35,5,35,7],[35,8,35,10],[35,13,35,15],[35,16,35,18],[33,5,33,7],[33,8,33,10],[33,13,33,15],[33,16,33,18],[34,5,34,7],[34,8,34,10],[34,13,34,15],[34,16,34,18]]}
["2017-09-10",null,null,null,"KWB Putte",null,null,null,null,null,2,"~","KWB voetbal Hombeek",null,null,null,null,null,5]
[]
[null,null,null,null,"1ste helft",null,null,null,null,null,null,null,"2de helft"]
[]
["Brian",null,null,null,null,null,null,null,null,null,null,null,null,null,null,null,null,null,null,null,"Albatros Mechelen"]
["Sakke",null,9,null,null,null,null,null,null,null,null,null,null,null,null,null,null,null,null,null,"Ani Mechelen"]
["Thomas",null,5,null,null,null,null,"Michael",null,null,null,null,null,null,null,"Michael",null,null,null,null,"Astra Begijnendijk"]
["Bob",null," ",null,null,null,null,null,null,null,null,null,null,null,null,null,null,null,null,null,"Boerenbond Broechem"]
["Glenn",null,88,null,null,null,null,null,null,null,null,null,null,null,null,null,null,null,null,null,"FC Blaasveld"]
["Gert",null,3,null,null,null,null,"Wally",null,null,null,null,null,null,null,"Wally",null,null,null,null,"KWB Putte"]
["Michael",null,7,null,null,null,null,null,null,null,null,null,null,null,null,null,null,null,null,null,"KWB voetbal Hombeek"]
["Vos",null,null,null,null,null,null,null,null,null,null,null,null,null,null,null,null,null,null,null,"Plenke Werchter"]
["Saïd",null,null,null,"Jerre",null,"Saïd",null,"Solle",null,"Wesley",null,"Habel",null,"Saïd",null,"Solle",null,"Wesley",null,"The Sylvesters Mechelen"]
["Angelo",null,10,null,null,null,null,null,null,null,null,null,null,null,null,null,null,null,null,null,"VFL Malines"]
["Stijn",null,null,null,null,null,null,null,null,null,null,null,null,null,null,null,null,null,null,null,"VK Jamaswapi Mechelen"]
["Hans",null,null,null,null,null,null,null,null,null,null,null,null,null,null,null,null,null,null,null,"VK Ludwina Bonheiden"]
["Imed",null,null,null,null,null,null,"Thomas",null,null,null,null,null,null,null,"Thomas",null,null,null,null,"VK Wakkerzeel"]
["Jerre",null,null,null,null,null,null,null,null,null,null,null,null,null,null,null,null,null,null,null,"Vosberg Sport"]
["Jochem",null,null,null,null,"Youri",null,null,null,"Kevin",null,null,null,"Youri",null,null,null,"Kevin"]
["Youri",null,null,null,null,null,null,"Gert",null,null,null,null,null,null,null,"Teck"]
["Arnie"]
["Mark"]
["Solle"]
["Gipsy",null,null,null,null,null,null,"Glenn",null,null,null,null,null,null,null,"Glenn"]
["Habel",null," "]
["Teck",null,6]
["Wesley",null,12,null,"Tijd","Uit",null,null,"In",null,null,null,"Tijd","Goal",null,null,"Assist"]
["Winghe",null,2,null,"46'","Gert",null,null,"Teck",null,null,null,"24'","Solle",null,null,"Michael"]
["Jonas",null,13,null,"46'","Jerre",null,null,"Habel",null,null,null,"41'","Wally",null,null,"Michael"]
["Bart",null,null,null,"50'","Michael",null,null,"Dimitri",null,null,null,"50'","Wesley",null,null,"Habel"]
["Kevin",null,8,null,"65'","Youri",null,null,"Jonas",null,null,null,"78'","Wesley",null,null,"Dimitri"]
["Dimitri",null,null,null,"65'","Saïd",null,null,"Jochem",null,null,null,"80'","Michael"]
["Nico",null,1,null,null,"Geel",null,null,"Rood"]
["Robbie"]
["Wally",null,11]